{"text_format":"1","workbook":"xlsx","n_sheets":18,"sheets":["Cover","Documentation >>","User Guide","ToC","Model formatting","Inputs >>","Time","WINEP_Inputs","InpActive","Calcs >>","WINEP_Schemes","WINEP_Allowance","Outputs >>","Annual_Outputs","F_Outputs","QA >>","Track","Check"],"not_rendered":{"charts":0,"images":1,"macros":1,"external_links":0,"defined_names":61,"comments":0,"pivot_tables":0},"unopened":[],"bounds":{"document_bytes":16777216,"sheet_cells":100000,"rows_first":2000,"rows_last":500,"rows_between":2000,"halvings":0,"cell_chars":16384,"cell_head_chars":4096},"cells_cut":0,"cells_raw":0,"read":"whole","date_system":"1900"}

{"sheet":"Cover","index":0,"n_rows":40,"n_cols":7,"rows_kept":40,"cut":false,"hidden":false,"merged":[[29,3,29,4],[24,3,24,4],[23,3,23,4],[20,3,20,4],[10,3,10,6],[11,3,11,6],[12,3,12,6],[13,3,13,6],[14,3,14,6],[26,3,26,4],[27,3,27,4],[25,3,25,4],[28,3,28,4]]}
[{"$f":" RIGHT(CELL(\"filename\", $A$1), LEN(CELL(\"filename\", $A$1)) - SEARCH(\"]\", CELL(\"filename\", $A$1)))","v":"Cover"}]
[]
[null,null,"Model name:","WINEP Reconciliation Model"]
[null,null,"Version number:","1n"]
[null,null,"Filename:","WINEP-Reconciliation-Model-Dec-2020-v1n.xlsm"]
[null,null,"Date:","2020-12-02"]
[null,null,"Author:","Ofwat"]
[null,null,"Author contact information:","OfwatPAndO@ofwat.gov.uk"]
[]
[]
[null,null,"Summary of model:","This illustrative model is designed to show how we will account for the impact of ministerial decisions on the scale of companies’ environmental enhancement programmes where this differs from our assumptions made at FD. Please note that, for brevity, the term 'WINEP' is used throughout. However, it should be taken to include both the WINEP in England and the NEP in Wales. "]
[null,null,null,"On sheet \"WINEP_Allowance\" we set out the adjustments we will make for each scheme in the company's WINEP programme that at the time of the final determination was unconfirmed. We show what will happen to adjust allowed totex for cost sharing, whether the scheme is confirmed as required or confirmed not required for the period 2020-25. For some companies there will be schemes listed that were not included in our enhancement allowance when we made our final determinations. We will make an opposite adjustment for these."]
[null,null,null,"On sheet \"WINEP_Schemes\" we convert the units used for each company’s unit cost mechanism as set out in the Cost Efficiency appendix to the company summary document of our Final Determinations. This is a bespoke conversion required for each company and the units shown are for illustration. Not all units shown will be relevant to every company."]
[null,null,null,"For most schemes the proportion confirmed will be either 100% or 0%. We have included a 'Proportion Confirmed' column to allow for the possibility that a scheme is partially confirmed. For example, if a scheme involves work on all reservoirs in a region but some reservoirs are subsequently sold then a reconciliation will be made to recover a proportion of the scheme's costs."]
[null,null,null,"Where schemes have been partially removed the company must present evidence that the proportion remaining has been signed off by the Environment Agency or Natural Resources Wales."]
[]
[null,null,null,"NB - The model price base is 'CPIH Financial year average 2017/18', unless otherwise stated. "]
[]
[]
[null,null,"Known limitations:","Issue",null,"Details","Model link"]
[null,null,null,"Illustrative Model",null,"This is an initial, illustrative model. We may make refinements to it in due course."]
[]
[null,null,"Change Log:","Sheet(s) in current model",null,"Description of change(s) made","Model link(s)"]
[null,null,null,"Track",null,"Linked to correct cells in model. Previously this was incorrectly linked to blank cells. Added some additional tracking lines.",{"$f":"Track!A1","v":"Track"}]
[null,null,null,"User Guide",null,"Expanded the description of how to load the WINEP input data.",{"$f":"'User Guide'!D13","v":"INITIAL SET UP"}]
[null,null,null,"WINEP_Schemes",null,"Relabelled \"Quantity\" as \"Quantity in PR19 FD\"",{"$f":" WINEP_Schemes!J9","v":"Quantity in PR19 FD"}]
[null,null,null,"WINEP_Schemes",null,"Added new column \"Quantity Delivered\" and changed the input \"Proportion confirmed\" to be a calculation of \"Quantity Delivered\" divided by \"Quantity in PR19 FD\".",{"$f":" WINEP_Schemes!K9","v":"Quantity Delivered"}]
[null,null,null,"WINEP_Schemes",null,"Changed all Inputs to be brought forward from the WINEP_Inputs sheet. This affects \"Unit\", \"Unit Conversion\", \"Quantity\" and \"Price Control\"",{"$f":" WINEP_Schemes!F9","v":"Unit"}]
[null,null,null,"WINEP_Inputs",null,"Columns CR to CX now contain the WINEP inputs that need to be manually entered. The columns have been re-labelled for clarity.",{"$f":" WINEP_Inputs!CR3","v":"WINEP model inputs"}]
[null,null,null,"Annual_Outputs",null,"Relabelled the WINEP reconciliation outputs and added additional text for clarity. ",{"$f":" Annual_Outputs!E26","v":"WINEP Reconciliation, water resources - without adjustment for time value of money"}]
[]
[null,null,"Instructions:","A model 'User guide' is present in the model to help the user in operating the model."]
[null,null,null,"Follow link >>","Goto User Guide"]
[]
[null,null,"Error check status:",{"$f":"Check!$F$2","v":0},{"$f":" IF(D35 = 0, \"No error checks\", \"Error checks active\")","v":"No error checks"}]
[null,null,null,{"$f":"Check!$F$3","v":3},{"$f":" IF(D36 = 0, \"No output changes\", \"Output changes\")","v":"Output changes"}]
[]
[]
[]
["End of sheet"]

{"sheet":"Documentation >>","index":1,"n_rows":0,"n_cols":0,"rows_kept":0,"cut":false,"hidden":false,"merged":[]}

{"sheet":"User Guide","index":2,"n_rows":85,"n_cols":5,"rows_kept":85,"cut":false,"hidden":false,"merged":[]}
[{"$f":" RIGHT(CELL(\"filename\", $A$1), LEN(CELL(\"filename\", $A$1)) - SEARCH(\"]\", CELL(\"filename\", $A$1)))","v":"User Guide"}]
[]
[null,"INTRODUCTION"]
[]
[null,null,null,null,"This model will calculate the WINEP reconciliation adjustment in £m."]
[]
[null,null,null,"NAVIGATION"]
[null,null,null,null,"In order to navigate through the model the following key strokes will prove useful:"]
[null,null,null,null,"- To go to a sheet or row select a blue font cell and then either press CTRL+ [ or double click"]
[null,null,null,null,"- To return to the last position press F5 + Enter"]
[null,null,null,null,"- In accordance with best practice, the model is saved with a \"Manual Calculation\" setting. To ensure a full recalculation press: Ctrl + Alt + F9"]
[]
[null,null,null,"INITIAL SET UP"]
[null,null,null,null,"On first use of the model the WINEP_inputs sheet needs to be updated from the 2019 WINEP spreadsheet. You must use the list of WINEP sites as at Final Determination. "]
[]
[null,null,null,"1)","The WINEP_Inputs sheet needs to be setup so that the correct information is loaded onto the WINEP_Schemes sheet. Since all companies have used different units the procedure for doing this will vary. Most companies will be able to follow the steps below:"]
[null,null,null,"Step 1 - ","In the WINEP workbook identify all schemes that were Amber in the PR19 Final Determination WINEP workbook."]
[null,null,null,"Step 2 - ","Copy the schemes to cell C5 of WINEP_Inputs maintaining the column layout of the PR19 Final Determination WINEP spreadsheet."]
[null,null,null,"Step 3 - ","Complete column CR for all rows, 'Allowed totex unit rate'. This feeds through to the WINEP_Schemes sheet and should be copied directly from the tables in the Cost Efficiency appendix to the company summary document of our Final Determinations."]
[null,null,null,"Step 4 - ","Complete column CS for all rows, 'Quantity proposed in PR19 FD. This feeds through to the WINEP_Schemes sheet and is the amount to be delivered as stated in the Cost Efficiency appendix to the company summary document of our Final Determinations. This should be entered in the appropriate units e.g. £m per benefit point, £ per km LORI, £ per kgP/day removed, etc"]
[null,null,null,"Step 5 - ","Complete column CT for all rows, 'Quantity Delivered'. This feeds through to the WINEP_Schemes sheet and is the actual amount delivered. The proportion confirmed is then calculated from the inputs in columns CS and CT."]
[null,null,null,"Step 6 - ","Complete column CU for all rows with a 1 if the scheme was costed in the FD or a 0 if the scheme was not costed"]
[null,null,null,"Step 7 - ","In column CV select for all rows the price control that the WINEP adjustment will be applied to"]
[null,null,null,"Step 8 - ","Enter the units into column CW and a conversion factor into column CX to convert into £m."]
[]
[null,null,null,"2)","InpTime sheet : This is the sheet where all the Inputs related to dates and timelines are set up:"]
[null,null,null,null,{"$f":"Time!A1","v":"Time"}]
[]
[null,null,null,"3)","InpAct sheet : This is the sheet where all the Inputs used in the model calculations are present, all the inputs flow from this sheet into the model calculations:"]
[null,null,null,null,{"$f":"InpActive!A1","v":"InpActive"}]
[null,null,null,null,"Update all Input cells as required."]
[]
[null,null,null,null,"Recalculate the model once all the sheets are updated. Press Ctrl + Alt + F9"]
[]
[]
[]
[null,"HOW TO SAVE A PDF COPY OF ANY SHEET"]
[]
[null,null,null,"Step 1 - ","To save a sheet in PDF format, press button \"Save as PDF\""]
[]
[]
[]
[null,null,null,"Step 2 - ","In the dialog box, \"Enter sheet name\", type the name of the sheet you want to save"]
[]
[null,null,null,"Step 3 - ","In the dialog box, \"Save As\" change the file name if required"]
[]
[null,null,null,"Step 4 - ","Press \"Save\" to save a Pdf copy of the sheet"]
[]
[]
[]
[null,"HOW TO STORE TRACK IN TRACK SHEET"]
[]
[null,null,null,"USING MACRO"]
[null,null,null,null,"To store Track in the Track sheet using the macro, follow the steps below:"]
[]
[null,null,null,"Step 1 - ","Go to the Track sheet and press the \"Store Track\" button to save the track for a new case"]
[null,null,null,null,"Store Track"]
[]
[null,null,null,"Step 2 - ","A dialog box \"Enter the label for the new track column\" will appear, type the new track label (for example: \"version 17r\"), the label will appear in row 6"]
[]
[null,null,null,"Step 3 - ","A dialog box \"Enter the comment for the new track\" will appear, write a brief description of the change. The description will be appear at the bottom of the track column"]
[]
[null,null,null,"Step 4 - ","Press enter, a new track column will appear before the last stored track"]
[]
[null,null,null,"Step 5 - ","Review the difference between stored cases and active case (col H) by selecting the stored case in cell H6."]
[]
[null,null,null,"MANUAL METHOD"]
[]
[null,null,null,null,"To store Track in the Track sheet manually, follow the steps below:"]
[]
[null,null,null,"Step 1 - ","Select the column by pressing Ctrl + Spacebar and Copy (Ctrl + C). Then insert a new column after the last stored column by pressing Alt, I, E"]
[]
[null,null,null,"Step 2 - ","Select the newly inserted column (Ctrl + Spacebar) and delete the previously stored values from this column by pressing Delete button"]
[]
[null,null,null,"Step 3 - ","Go to active track column (H column). Select the range from H6 till 'do not delete row - range end' row and Copy (Ctrl + C)"]
[]
[null,null,null,"Step 4 - ","Paste the selected values (Alt E, S, V) in newly inserted column"]
[]
[null,null,null,"Step 5 - ","Update 'New track name' in row 6 of newly inserted column. Then select 'New track name' from the dropdown list present in H6."]
[]
[null,null,null,"Step 6 - ","Review the difference between stored cases and active case (col H) by selecting the stored case in cell H6."]
[]
[]
[]
["End of sheet"]

{"sheet":"ToC","index":3,"n_rows":25,"n_cols":26,"rows_kept":25,"cut":false,"hidden":false,"merged":[]}
[{"$f":" RIGHT(CELL(\"filename\", $A$1), LEN(CELL(\"filename\", $A$1)) - SEARCH(\"]\", CELL(\"filename\", $A$1)))","v":"ToC"}]
[]
["GENERIC MODEL DESIGN"]
[]
[null,null,null,null,null,"Table of Contents"]
[]
[]
[null,null,null,null,null,null,null,"DOCUMENTATION",null,null,null,"MODEL INPUTS",null,null,null,null,"MODEL CALCULATIONS",null,null,null,null,"MODEL OUTPUTS",null,null,null,"MODEL QA"]
[]
[null,null,null,null,null,null,null,"Cover",null,null,null,"WINEP_Inputs",null,null,null,null,"WINEP_Schemes",null,null,null,null,"Annual_Outputs",null,null,null,"Check"]
[null,null,null,null,null,null,null,"Model cover sheet",null,null,null,"WINEP inputs from business plans",null,null,null,null,"List of WINEP Amber schemes",null,null,null,null,"Annual profile of WINEP reconciliation",null,null,null,"Checks"]
[]
[null,null,null,null,null,null,null,"User Guide",null,null,null,"Time",null,null,null,null,"WINEP_Allowance",null,null,null,null,"F_Outputs",null,null,null,"Track"]
[null,null,null,null,null,null,null,"Explanation of setup and macros",null,null,null,"Dates and timelines",null,null,null,null,"Calculation of allowed cost",null,null,null,null,"Outputs to be uploaded to Fountain",null,null,null,"Model changes and track records"]
[]
[null,null,null,null,null,null,null,"ToC",null,null,null,"InpActive"]
[null,null,null,null,null,null,null,"Table of contents",null,null,null,"All inputs to be flowed into model"]
[]
[null,null,null,null,null,null,null,"Style Guide"]
[null,null,null,null,null,null,null,"Explanation of different formatting types"]
[]
[]
[]
[]
["End of sheet"]

{"sheet":"Model formatting","index":4,"n_rows":72,"n_cols":7,"rows_kept":72,"cut":false,"hidden":false,"merged":[]}
[{"$f":" RIGHT(CELL(\"filename\", $A$1), LEN(CELL(\"filename\", $A$1)) - SEARCH(\"]\", CELL(\"filename\", $A$1)))","v":"Model formatting"}]
[]
[]
["SHEET TABS"]
[]
[null,null,null,null,"Light Yellow",null,"Input sheets"]
[]
[null,null,null,null,"No colour (default Excel tab colour)",null,"Calculation and documentation sheets"]
[]
[null,null,null,null,"Pale Blue",null,"Key output sheets"]
[]
[null,null,null,null,"Turquoise",null,"Quality control sheets"]
[]
[null,null,null,null,"Yellow",null,"To be completed, temporary, restructured, or deleted"]
[]
[null,null,null,null,"Orange",null,"To be used for internal purposes only, removed prior to publication"]
[]
["COLOUR"]
[]
[null,"Font colour only"]
[null,null,null,null,"Blue font",null,"Imported from another sheet"]
[]
[null,null,null,null,"Red font ",null,"Exported to another sheet (except from Input sheets)"]
[]
[null,null,null,null,"Black font",null,"Within sheet link or calculation"]
[]
[null,"Font + shade combinations"]
[null,null,null,null,"Black font + Light Yellow shade",null,"Inputs"]
[]
[null,null,null,null,"Black font + Light Grey shade on entire row",null,"Within-worksheet counter-flow "]
[]
[null,null,null,null,"Blue font + Light Grey shade on entire row",null,"Between-worksheet counter-flow "]
[]
[null,null,null,null,"Empty Cell with Light Grey shade",null,"Empty cells being deliberately referenced"]
[]
[null,"Other"]
[null,null,null,null,"Black font + Pale Blue shade on entire row",null,"Section separator"]
[]
[null,null,null,null,"Light Turquoise shade",null,"Stored/dead/hard coded outputs"]
[]
[null,null,null,null,"Tan shade",null,"Pre-model time line actuals"]
[]
[null,null,null,null,"Yellow shade",null,"Work in progress / temporary"]
[]
[null,null,null,null,"Lime shade",null,"Values or logic to be reviewed"]
[]
[null,"Error checks & alerts"]
[null,null,null,null,"Green shade",null,"OK"]
[]
[null,null,null,null,"Red shade",null,"Error"]
[]
[null,null,null,null,"Gold shade",null,"Alert"]
[]
["ABBREVIATIONS"]
[]
[null,null,null,null,"WINEP",null,"Water Industry National Environment Programme"]
[null,null,null,null,"£",null,"Great Britain Pound"]
[null,null,null,null,"m",null,"Million"]
[null,null,null,null,"na",null,"Not available / applicable"]
[null,null,null,null,"#",null,"Number"]
[]
["LIST OF MACROS USED"]
[]
[null,null,null,null,"Store track results"]
[null,null,null,null,null,null,"This macro helps in storing the results/outputs after any change is made in the model on \"Track\" sheet."]
[null,null,null,null,null,null,"These stored results then can be used to analyse the impact of any change made in the model."]
[null,null,null,null,null,null,"Goto macro"]
[]
[null,null,null,null,"Save as PDF"]
[null,null,null,null,null,null,"This macro helps in saving any worksheet or chart in PDF format."]
[]
["END OF SHEET"]

{"sheet":"Inputs >>","index":5,"n_rows":0,"n_cols":0,"rows_kept":0,"cut":false,"hidden":false,"merged":[]}

{"sheet":"Time","index":6,"n_rows":133,"n_cols":20,"rows_kept":133,"cut":false,"hidden":false,"merged":[]}
[{"$f":" RIGHT(CELL(\"filename\", $A$1), LEN(CELL(\"filename\", $A$1)) - SEARCH(\"]\", CELL(\"filename\", $A$1)))","v":"Time"}]
[null,null,null,null,{"$f":" Time!E$25","v":"Model period ending"},null,null,null,null,{"$f":" Time!J$25","v":"2019-03-31"},{"$f":" Time!K$25","v":"2020-03-31"},{"$f":" Time!L$25","v":"2021-03-31"},{"$f":" Time!M$25","v":"2022-03-31"},{"$f":" Time!N$25","v":"2023-03-31"},{"$f":" Time!O$25","v":"2024-03-31"},{"$f":" Time!P$25","v":"2025-03-31"},{"$f":" Time!Q$25","v":"2026-03-31"},{"$f":" Time!R$25","v":"2027-03-31"},{"$f":" Time!S$25","v":"2028-03-31"},{"$f":" Time!T$25","v":"2029-03-31"}]
[null,null,null,null,{"$f":" Time!E$107","v":"Timeline label"},null,null,null,null,{"$f":" Time!J$107","v":"Pre-Fcst"},{"$f":" Time!K$107","v":"Pre-Fcst"},{"$f":" Time!L$107","v":"Forecast"},{"$f":" Time!M$107","v":"Forecast"},{"$f":" Time!N$107","v":"Forecast"},{"$f":" Time!O$107","v":"Forecast"},{"$f":" Time!P$107","v":"Forecast"},{"$f":" Time!Q$107","v":"Post-Fcst"},{"$f":" Time!R$107","v":"Post-Fcst"},{"$f":" Time!S$107","v":"Post-Fcst"},{"$f":" Time!T$107","v":"Post-Fcst"}]
[null,null,null,null,{"$f":" Time!E$130","v":"Financial year ending"},null,null,null,null,{"$f":" Time!J$130","v":2019},{"$f":" Time!K$130","v":2020},{"$f":" Time!L$130","v":2021},{"$f":" Time!M$130","v":2022},{"$f":" Time!N$130","v":2023},{"$f":" Time!O$130","v":2024},{"$f":" Time!P$130","v":2025},{"$f":" Time!Q$130","v":2026},{"$f":" Time!R$130","v":2027},{"$f":" Time!S$130","v":2028},{"$f":" Time!T$130","v":2029}]
[null,null,null,null,{"$f":" Time!E$10","v":"Model column counter"},"Constant","Unit","Total",null,{"$f":" Time!J$10","v":1},{"$f":" Time!K$10","v":2},{"$f":" Time!L$10","v":3},{"$f":" Time!M$10","v":4},{"$f":" Time!N$10","v":5},{"$f":" Time!O$10","v":6},{"$f":" Time!P$10","v":7},{"$f":" Time!Q$10","v":8},{"$f":" Time!R$10","v":9},{"$f":" Time!S$10","v":10},{"$f":" Time!T$10","v":11}]
[]
["MODEL PERIOD"]
[]
[null,"Model column counter "]
[null,null,null,null,"Model column counter",null,"counter",null,null,{"$f":" I10 + 1","v":1},{"$f":" J10 + 1","v":2},{"$f":" K10 + 1","v":3},{"$f":" L10 + 1","v":4},5,6,{"$f":" O10 + 1","v":7},{"$f":" P10 + 1","v":8},{"$f":" Q10 + 1","v":9},{"$f":" R10 + 1","v":10},11]
[null,null,null,null,"Model column total",{"$f":" MAX(J10:T10)","v":11},"columns"]
[]
[null,null,null,null,{"$f":" E$10","v":"Model column counter"},0,"counter",{"$f":" H$10","v":0},0,{"$f":" J$10","v":1},2,3,4,5,6,7,8,9,10,11]
[null,null,null,null,"1st model column flag",null,"flag",{"$f":" SUM(J14:T14)","v":1},null,{"$f":" IF(J13 = 1, 1, 0)","v":1},{"$f":" IF(K13 = 1, 1, 0)","v":0},0,{"$f":" IF(M13 = 1, 1, 0)","v":0},{"$f":" IF(N13 = 1, 1, 0)","v":0},0,{"$f":" IF(P13 = 1, 1, 0)","v":0},{"$f":" IF(Q13 = 1, 1, 0)","v":0},{"$f":" IF(R13 = 1, 1, 0)","v":0},{"$f":" IF(S13 = 1, 1, 0)","v":0},0]
[]
[null,"Model period beginning"]
[null,null,null,null,{"$f":"InpActive!E12","v":"1st model column start date"},{"$f":"InpActive!F12","v":"2018-04-01"},{"$f":"InpActive!G12","v":"date"}]
[null,null,null,null,{"$f":"InpActive!E$39","v":"Months per model period"},{"$f":"InpActive!F$39","v":12},{"$f":"InpActive!G$39","v":"months"}]
[null,null,null,null,{"$f":" E$14","v":"1st model column flag"},0,"flag",{"$f":" H$14","v":1},0,{"$f":" J$14","v":1},0,0,0,0,0,0,0,0,0,0]
[null,null,null,null,"Model period beginning",null,"date",null,null,{"$f":" IF(J19 = 1, $F17, DATE(YEAR(I20), MONTH(I20) + $F18, DAY(1)))","v":"2018-04-01"},{"$f":" IF(K19 = 1, $F17, DATE(YEAR(J20), MONTH(J20) + $F18, DAY(1)))","v":"2019-04-01"},{"$f":" IF(L19 = 1, $F17, DATE(YEAR(K20), MONTH(K20) + $F18, DAY(1)))","v":"2020-04-01"},{"$f":" IF(M19 = 1, $F17, DATE(YEAR(L20), MONTH(L20) + $F18, DAY(1)))","v":"2021-04-01"},{"$f":" IF(N19 = 1, $F17, DATE(YEAR(M20), MONTH(M20) + $F18, DAY(1)))","v":"2022-04-01"},"2023-04-01",{"$f":" IF(P19 = 1, $F17, DATE(YEAR(O20), MONTH(O20) + $F18, DAY(1)))","v":"2024-04-01"},{"$f":" IF(Q19 = 1, $F17, DATE(YEAR(P20), MONTH(P20) + $F18, DAY(1)))","v":"2025-04-01"},{"$f":" IF(R19 = 1, $F17, DATE(YEAR(Q20), MONTH(Q20) + $F18, DAY(1)))","v":"2026-04-01"},{"$f":" IF(S19 = 1, $F17, DATE(YEAR(R20), MONTH(R20) + $F18, DAY(1)))","v":"2027-04-01"},"2028-04-01"]
[]
[null,"Model period ending"]
[null,null,null,null,{"$f":"InpActive!E$39","v":"Months per model period"},{"$f":"InpActive!F$39","v":12},{"$f":"InpActive!G$39","v":"months"}]
[null,null,null,null,{"$f":" E$20","v":"Model period beginning"},"00:00:00","date","00:00:00","00:00:00","2018-04-01","2019-04-01","2020-04-01","2021-04-01","2022-04-01","2023-04-01","2024-04-01","2025-04-01","2026-04-01","2027-04-01","2028-04-01"]
[null,null,null,null,"Model period ending",null,"date",null,null,{"$f":" DATE(YEAR(J24), MONTH(J24) + $F23, DAY(J24) - 1)","v":"2019-03-31"},{"$f":" DATE(YEAR(K24), MONTH(K24) + $F23, DAY(K24) - 1)","v":"2020-03-31"},"2021-03-31","2022-03-31","2023-03-31","2024-03-31",{"$f":" DATE(YEAR(P24), MONTH(P24) + $F23, DAY(P24) - 1)","v":"2025-03-31"},{"$f":" DATE(YEAR(Q24), MONTH(Q24) + $F23, DAY(Q24) - 1)","v":"2026-03-31"},{"$f":" DATE(YEAR(R24), MONTH(R24) + $F23, DAY(R24) - 1)","v":"2027-03-31"},{"$f":" DATE(YEAR(S24), MONTH(S24) + $F23, DAY(S24) - 1)","v":"2028-03-31"},"2029-03-31"]
[]
[null,null,null,null,{"$f":" E$25","v":"Model period ending"},"00:00:00","date","00:00:00","00:00:00","2019-03-31","2020-03-31","2021-03-31","2022-03-31","2023-03-31","2024-03-31","2025-03-31","2026-03-31","2027-03-31","2028-03-31","2029-03-31"]
[null,null,null,null,{"$f":" E$20","v":"Model period beginning"},"00:00:00","date","00:00:00","00:00:00","2018-04-01","2019-04-01","2020-04-01","2021-04-01","2022-04-01","2023-04-01","2024-04-01","2025-04-01","2026-04-01","2027-04-01","2028-04-01"]
[null,null,null,null,"Days in a year",null,"days",null,null,{"$f":" J27 - J28 + 1","v":365},{"$f":" K27 - K28 + 1","v":366},365,365,365,366,365,365,365,{"$f":" S27 - S28 + 1","v":366},365]
[]
[]
["FORECAST PERIOD"]
[]
[null,"Forecast start period flag"]
[null,null,null,null,{"$f":"InpActive!E$25","v":"Forecast start date"},{"$f":"InpActive!F$25","v":"2020-04-01"},{"$f":"InpActive!G$25","v":"date"}]
[null,null,null,null,{"$f":" E$20","v":"Model period beginning"},"00:00:00","date","00:00:00","00:00:00","2018-04-01","2019-04-01","2020-04-01","2021-04-01","2022-04-01","2023-04-01","2024-04-01","2025-04-01","2026-04-01","2027-04-01","2028-04-01"]
[null,null,null,null,{"$f":" E$25","v":"Model period ending"},"00:00:00","date","00:00:00","00:00:00","2019-03-31","2020-03-31","2021-03-31","2022-03-31","2023-03-31","2024-03-31","2025-03-31","2026-03-31","2027-03-31","2028-03-31","2029-03-31"]
[null,null,null,null,"Forecast start period flag",null,"flag",{"$f":" SUM(J38:T38)","v":1},null,{"$f":" IF(AND($F35 >= J36, $F35 <= J37), 1, 0)","v":0},{"$f":" IF(AND($F35 >= K36, $F35 <= K37), 1, 0)","v":0},1,0,0,0,{"$f":" IF(AND($F35 >= P36, $F35 <= P37), 1, 0)","v":0},{"$f":" IF(AND($F35 >= Q36, $F35 <= Q37), 1, 0)","v":0},{"$f":" IF(AND($F35 >= R36, $F35 <= R37), 1, 0)","v":0},{"$f":" IF(AND($F35 >= S36, $F35 <= S37), 1, 0)","v":0},0]
[]
[null,"Forecast end period flag"]
[null,null,null,null,{"$f":"InpActive!E$25","v":"Forecast start date"},{"$f":"InpActive!F$25","v":"2020-04-01"},{"$f":"InpActive!G$25","v":"date"}]
[null,null,null,null,{"$f":"InpActive!E26","v":"Forecast duration"},{"$f":"InpActive!F26","v":5},{"$f":"InpActive!G26","v":"years"}]
[null,null,null,null,"Forecast end date",{"$f":" DATE(YEAR(F41) + F42, MONTH(F41), DAY(F41) - 1)","v":"2025-03-31"},"date"]
[]
[null,null,null,null,{"$f":" E$43","v":"Forecast end date"},{"$f":" F$43","v":"2025-03-31"},{"$f":" G$43","v":"date"}]
[null,null,null,null,{"$f":" E$20","v":"Model period beginning"},"00:00:00","date","00:00:00","00:00:00","2018-04-01","2019-04-01","2020-04-01","2021-04-01","2022-04-01","2023-04-01","2024-04-01","2025-04-01","2026-04-01","2027-04-01","2028-04-01"]
[null,null,null,null,{"$f":" E$25","v":"Model period ending"},"00:00:00","date","00:00:00","00:00:00","2019-03-31","2020-03-31","2021-03-31","2022-03-31","2023-03-31","2024-03-31","2025-03-31","2026-03-31","2027-03-31","2028-03-31","2029-03-31"]
[null,null,null,null,"Forecast end period flag",null,"flag",{"$f":" SUM(J48:T48)","v":1},null,{"$f":" IF(AND($F45 >= J46, $F45 <= J47), 1, 0)","v":0},{"$f":" IF(AND($F45 >= K46, $F45 <= K47), 1, 0)","v":0},{"$f":" IF(AND($F45 >= L46, $F45 <= L47), 1, 0)","v":0},{"$f":" IF(AND($F45 >= M46, $F45 <= M47), 1, 0)","v":0},0,0,1,0,0,{"$f":" IF(AND($F45 >= S46, $F45 <= S47), 1, 0)","v":0},0]
[]
[null,"Forecast period flag"]
[null,null,null,null,{"$f":" E$38","v":"Forecast start period flag"},{"$f":" F$38","v":0},"flag",{"$f":" H$38","v":1},0,0,0,1,0,0,0,0,0,0,0,0]
[null,null,null,null,{"$f":" E$48","v":"Forecast end period flag"},{"$f":" F$48","v":0},"flag",{"$f":" H$48","v":1},0,0,0,0,0,0,0,1,0,0,0,0]
[null,null,null,null,"Forecast period flag",null,"flag",{"$f":" SUM(J53:T53)","v":5},null,{"$f":" J51 + I53 - I52","v":0},{"$f":" K51 + J53 - J52","v":0},{"$f":" L51 + K53 - K52","v":1},{"$f":" M51 + L53 - L52","v":1},1,1,{"$f":" P51 + O53 - O52","v":1},{"$f":" Q51 + P53 - P52","v":0},{"$f":" R51 + Q53 - Q52","v":0},{"$f":" S51 + R53 - R52","v":0},0]
[null,null,null,null,"Total number of forecast periods ",{"$f":" SUM(J53:R53)","v":5},"periods"]
[]
[null,"Forecast period counter"]
[null,null,null,null,{"$f":"E38","v":"Forecast start period flag"},{"$f":"F38","v":0},"flag",1,0,0,{"$f":"K38","v":0},1,0,0,0,0,0,0,0,0]
[null,null,null,null,{"$f":"E53","v":"Forecast period flag"},{"$f":"F53","v":0},"flag",5,0,0,{"$f":"K53","v":0},1,1,1,1,1,0,0,0,0]
[null,null,null,null,{"$f":"E48","v":"Forecast end period flag"},{"$f":"F48","v":0},"flag",1,0,{"$f":"J48","v":0},{"$f":"K48","v":0},{"$f":"L48","v":0},0,0,0,1,0,0,0,0]
[null,null,null,null,"Forecast period counter",null,"counter",null,null,{"$f":" IF(J57 = 1, 1, I60 + J58 - I59) * J58","v":0},{"$f":" IF(K57 = 1, 1, J60 + K58 - J59) * K58","v":0},{"$f":" IF(L57 = 1, 1, K60 + L58 - K59) * L58","v":1},{"$f":" IF(M57 = 1, 1, L60 + M58 - L59) * M58","v":2},{"$f":" IF(N57 = 1, 1, M60 + N58 - M59) * N58","v":3},4,5,0,0,0,0]
[]
[null,"Pre-forecast period flag"]
[null,null,null,null,{"$f":" E$14","v":"1st model column flag"},{"$f":" F$14","v":0},"flag",1,0,1,0,0,0,0,0,0,0,0,0,0]
[null,null,null,null,{"$f":" E$38","v":"Forecast start period flag"},{"$f":" F$38","v":0},"flag",1,0,0,0,1,0,0,0,0,0,0,0,0]
[null,null,null,null,"Pre-forecast period flag",null,"flag",{"$f":" SUM(J65:T65)","v":2},null,{"$f":" J63 + I65 - J64","v":1},{"$f":" K63 + J65 - K64","v":1},{"$f":" L63 + K65 - L64","v":0},{"$f":" M63 + L65 - M64","v":0},0,0,{"$f":" P63 + O65 - P64","v":0},{"$f":" Q63 + P65 - Q64","v":0},{"$f":" R63 + Q65 - R64","v":0},{"$f":" S63 + R65 - S64","v":0},0]
[null,null,null,null,"Pre-forecast period flag - total",{"$f":" SUM(J65:T65)","v":2},"periods"]
[]
[null,null,null,null,{"$f":" E$38","v":"Forecast start period flag"},{"$f":" F$38","v":0},"flag",1,0,{"$f":" J$38","v":0},0,1,0,0,0,0,0,0,0,0]
[null,null,null,null,"Last pre-forecast period flag",null,"flag",{"$f":" SUM(J69:T69)","v":{"$error":"#REF!"}},null,{"$f":" K68","v":0},{"$f":" L68","v":1},{"$f":" M68","v":0},{"$f":" N68","v":0},0,0,{"$f":" Q68","v":0},{"$f":" R68","v":0},{"$f":" S68","v":0},{"$f":" T68","v":0},{"$f":"#REF!","v":{"$error":"#REF!"}}]
[]
[null,"First post-forecast period flag"]
[null,null,null,null,{"$f":" E$48","v":"Forecast end period flag"},{"$f":" F$48","v":0},"flag",1,0,{"$f":" J$48","v":0},0,0,0,0,0,1,0,0,0,0]
[null,null,null,null,"First post-forecast period flag",null,"flag",{"$f":" SUM(J73:T73)","v":1},null,{"$f":" I72","v":0},{"$f":" J72","v":0},{"$f":" K72","v":0},{"$f":" L72","v":0},0,0,{"$f":" O72","v":0},{"$f":" P72","v":1},{"$f":" Q72","v":0},{"$f":" R72","v":0},0]
[]
[null,"Post-forecast period flag"]
[null,null,null,null,{"$f":" E$73","v":"First post-forecast period flag"},0,"flag",1,0,0,0,0,0,0,0,0,1,0,0,0]
[null,null,null,null,"Post-forecast period flag",null,"flag",{"$f":" SUM(J77:T77)","v":4},null,{"$f":" J76 + I77","v":0},{"$f":" K76 + J77","v":0},{"$f":" L76 + K77","v":0},{"$f":" M76 + L77","v":0},0,0,{"$f":" P76 + O77","v":0},{"$f":" Q76 + P77","v":1},{"$f":" R76 + Q77","v":1},{"$f":" S76 + R77","v":1},1]
[null,null,null,null,"Post-forecast period - total",{"$f":" SUM(J77:T77)","v":4},"periods"]
[]
[null,"Model period flag"]
[null,null,null,null,{"$f":" E$53","v":"Forecast period flag"},{"$f":" F$53","v":0},"flag",5,0,0,0,1,1,1,1,1,0,0,0,0]
[null,null,null,null,{"$f":" E$65","v":"Pre-forecast period flag"},{"$f":" F$65","v":0},"flag",2,0,1,1,0,0,0,0,0,0,0,0,0]
[null,null,null,null,"Model period flag",null,"flag",{"$f":" SUM(J83:T83)","v":7},null,{"$f":" MAX(J81:J82)","v":1},{"$f":" MAX(K81:K82)","v":1},1,1,1,1,1,0,0,{"$f":" MAX(S81:S82)","v":0},0]
[]
[null,"Forecast year"]
[null,null,null,null,{"$f":" E$130","v":"Financial year ending"},{"$f":" F$130","v":0},"year #",0,0,2019,2020,2021,2022,2023,2024,2025,2026,2027,2028,2029]
[null,null,null,null,{"$f":" E$38","v":"Forecast start period flag"},{"$f":" F$38","v":0},"flag",1,0,0,0,1,0,0,0,0,0,0,0,0]
[null,null,null,null,"Forecast year 1",{"$f":" SUMPRODUCT(J87:T87, J86:T86)","v":2021},"year #"]
[]
[null,"Forecast year"]
[null,null,null,null,{"$f":" InpActive!E$29","v":"Forecast period reconcilation is profiled from"},{"$f":" InpActive!F$29","v":3},{"$f":" InpActive!G$29","v":"year"}]
[null,null,null,null,{"$f":"E60","v":"Forecast period counter"},0,"counter",0,0,0,0,1,2,3,4,5,0,0,0,0]
[null,null,null,null,"Start of adjustment profiling flag",null,"counter",{"$f":" SUM(J93:T93)","v":3},null,{"$f":" IF(J92 >= $F91, 1, 0)","v":0},{"$f":" IF(K92 >= $F91, 1, 0)","v":0},0,0,1,1,1,0,0,0,0]
[]
["MODEL TIMELINE"]
[]
[null,"Timeline label"]
[null,null,null,null,{"$f":" E$14","v":"1st model column flag"},0,"flag",1,0,1,0,0,0,0,0,0,0,0,0,0]
[null,null,null,null,{"$f":" E$38","v":"Forecast start period flag"},{"$f":" F$38","v":0},"flag",1,0,0,0,1,0,0,0,0,0,0,0,0]
[null,null,null,null,{"$f":" E$73","v":"First post-forecast period flag"},0,"flag",1,0,0,0,0,0,0,0,0,1,0,0,0]
[null,null,null,null,"Timeline label counter",null,"counter",null,null,{"$f":" I101 + SUM(J98:J100)","v":1},{"$f":" J101 + SUM(K98:K100)","v":1},{"$f":" K101 + SUM(L98:L100)","v":2},{"$f":" L101 + SUM(M98:M100)","v":2},2,2,{"$f":" O101 + SUM(P98:P100)","v":2},{"$f":" P101 + SUM(Q98:Q100)","v":3},{"$f":" Q101 + SUM(R98:R100)","v":3},{"$f":" R101 + SUM(S98:S100)","v":3},3]
[]
[null,null,null,null,{"$f":"InpActive!E19","v":"Pre - forecast period"},{"$f":"InpActive!F19","v":"Pre-Fcst"},{"$f":"InpActive!G19","v":"label"}]
[null,null,null,null,{"$f":"InpActive!E20","v":"Forecast period"},{"$f":"InpActive!F20","v":"Forecast"},{"$f":"InpActive!G20","v":"label"}]
[null,null,null,null,{"$f":"InpActive!E21","v":"Post - forecast period"},{"$f":"InpActive!F21","v":"Post-Fcst"},{"$f":"InpActive!G21","v":"label"}]
[null,null,null,null,{"$f":" E$101","v":"Timeline label counter"},0,"counter",0,0,1,1,2,2,2,2,2,3,3,3,3]
[null,null,null,null,"Timeline label",null,"label",null,null,{"$f":" INDEX($F103:$F105, J106)","v":"Pre-Fcst"},{"$f":" INDEX($F103:$F105, K106)","v":"Pre-Fcst"},{"$f":" INDEX($F103:$F105, L106)","v":"Forecast"},{"$f":" INDEX($F103:$F105, M106)","v":"Forecast"},{"$f":" INDEX($F103:$F105, N106)","v":"Forecast"},{"$f":" INDEX($F103:$F105, O106)","v":"Forecast"},{"$f":" INDEX($F103:$F105, P106)","v":"Forecast"},{"$f":" INDEX($F103:$F105, Q106)","v":"Post-Fcst"},{"$f":" INDEX($F103:$F105, R106)","v":"Post-Fcst"},{"$f":" INDEX($F103:$F105, S106)","v":"Post-Fcst"},"Post-Fcst"]
[]
[null,"Modelling period check"]
[null,null,null,null,{"$f":" E$65","v":"Pre-forecast period flag"},{"$f":" F$65","v":0},"flag",2,0,1,1,0,0,0,0,0,0,0,0,0]
[null,null,null,null,{"$f":" E$53","v":"Forecast period flag"},{"$f":" F$53","v":0},"flag",5,0,0,0,1,1,1,1,1,0,0,0,0]
[null,null,null,null,{"$f":" E$77","v":"Post-forecast period flag"},0,"flag",4,0,0,0,0,0,0,0,0,1,1,1,1]
[null,null,null,null,"No. of overlapping in flags",null,"#",{"$f":" SUM(J113:T113)","v":0},null,{"$f":" MAX(0, SUM(J110:J112) - 1)","v":0},{"$f":" MAX(0, SUM(K110:K112) - 1)","v":0},{"$f":" MAX(0, SUM(L110:L112) - 1)","v":0},{"$f":" MAX(0, SUM(M110:M112) - 1)","v":0},{"$f":" MAX(0, SUM(N110:N112) - 1)","v":0},0,{"$f":" MAX(0, SUM(P110:P112) - 1)","v":0},{"$f":" MAX(0, SUM(Q110:Q112) - 1)","v":0},{"$f":" MAX(0, SUM(R110:R112) - 1)","v":0},{"$f":" MAX(0, SUM(S110:S112) - 1)","v":0},0]
[null,null,null,null,"Overlapping in periods - total",{"$f":" SUM(J113:T113)","v":0},"periods"]
[]
[null,null,null,null,{"$f":" E$11","v":"Model column total"},{"$f":" F$11","v":11},{"$f":" G$11","v":"columns"}]
[null,null,null,null,{"$f":" E$114","v":"Overlapping in periods - total"},{"$f":" F$114","v":0},{"$f":" G$114","v":"periods"}]
[null,null,null,null,{"$f":" E$66","v":"Pre-forecast period flag - total"},{"$f":" F$66","v":2},{"$f":" G$66","v":"periods"}]
[null,null,null,null,{"$f":" E$54","v":"Total number of forecast periods "},{"$f":" F$54","v":5},{"$f":" G$54","v":"periods"}]
[null,null,null,null,{"$f":" E$78","v":"Post-forecast period - total"},{"$f":" F$78","v":4},{"$f":" G$78","v":"periods"}]
[null,null,null,null,"Modelling period check",{"$f":" IF(SUM(F116:F117) - SUM(F118:F120) <> 0, 1, 0)","v":0},"check"]
[]
[]
["FINANCIAL YEAR"]
[]
[null,null,null,null,{"$f":"InpActive!E15","v":"First modelling column financial year #"},{"$f":"InpActive!F15","v":2019},{"$f":"InpActive!G15","v":"year #"}]
[null,null,null,null,{"$f":"InpActive!E16","v":"Financial year end month number #"},{"$f":"InpActive!F16","v":3},{"$f":"InpActive!G16","v":"month #"}]
[null,null,null,null,{"$f":" E$25","v":"Model period ending"},"00:00:00","date","00:00:00","00:00:00","2019-03-31","2020-03-31","2021-03-31","2022-03-31","2023-03-31","2024-03-31","2025-03-31","2026-03-31","2027-03-31","2028-03-31","2029-03-31"]
[null,null,null,null,{"$f":" E$14","v":"1st model column flag"},0,"flag",1,0,1,0,0,0,0,0,0,0,0,0,0]
[null,null,null,null,"Financial year ending",null,"year #",null,null,{"$f":" IF(J129 = 1, $F126, IF(J128 > (DATE(I130, $F127 + 1, 1) - 1), I130 + 1, I130))","v":2019},{"$f":" IF(K129 = 1, $F126, IF(K128 > (DATE(J130, $F127 + 1, 1) - 1), J130 + 1, J130))","v":2020},{"$f":" IF(L129 = 1, $F126, IF(L128 > (DATE(K130, $F127 + 1, 1) - 1), K130 + 1, K130))","v":2021},{"$f":" IF(M129 = 1, $F126, IF(M128 > (DATE(L130, $F127 + 1, 1) - 1), L130 + 1, L130))","v":2022},2023,2024,{"$f":" IF(P129 = 1, $F126, IF(P128 > (DATE(O130, $F127 + 1, 1) - 1), O130 + 1, O130))","v":2025},{"$f":" IF(Q129 = 1, $F126, IF(Q128 > (DATE(P130, $F127 + 1, 1) - 1), P130 + 1, P130))","v":2026},{"$f":" IF(R129 = 1, $F126, IF(R128 > (DATE(Q130, $F127 + 1, 1) - 1), Q130 + 1, Q130))","v":2027},{"$f":" IF(S129 = 1, $F126, IF(S128 > (DATE(R130, $F127 + 1, 1) - 1), R130 + 1, R130))","v":2028},2029]
[]
[]
["End of sheet"]

{"sheet":"WINEP_Inputs","index":7,"n_rows":247,"n_cols":128,"rows_kept":247,"cut":false,"hidden":false,"merged":[[1,18,1,19]]}
["WINEP3  Update March 2019",null,null,null,null,null,null,"National Full data set "]
[null,null,null,null,null,null,null,null,null,null,null,null,null,null,null,null,null,null,null,null,null,null,null,null,null,null,null,null,null,null,null,null,null,null,"FBG Detail"]
["VERSION 1",null,null,null,null,null,null,null,null,null,null,null,null,null,null,null,null,null,null,null,null,null,null,null,null,null,null,null,null,null,null,null,null,null,"SSSI/N2K/Ramsar",null,null,null,null,"Eels",null,"NERC Driver",null,null,null,null,null,null,null,"INNS",null,"MCZ","Water Quality Detail",null,null,null,null,null,null,null,null,null,null,null,null,null,null,null,null,null,null,null,null,null,null,"Water Resource Detail",null,null,null,null,null,null,null,null,null,"Environmental Outcome ",null,null,null,null,null,null,null,null,null,"WINEP model inputs"]
["WINEPID","Change Log Winep 2 to 3  ","NEW Column. Has an alteration to this measure been made? If Y then please refer to alterations log. ","Application in determination by NPS?","Has a permit been issued?","Function","RBD","Area","Water Company ","Unique ID *   (completed on company collation)","Scheme Name/Name of Investigation/Site Name/Licence name","Name of Waterbody","Waterbody ID","Water Body Type(s)","WFD Operational Catchment","Blank Column","Blank Column","Blank Column","Driver Code \n(Primary)","Further Driver Code Information \n(related to the primary driver if applicable)","Driver Code \n(Secondary)","Further Driver Code Information \n(related to the secondary driver if applicable)","Driver Code\n(Tertiary)","Further Driver Code Information \n(related to the tertiary driver if applicable)","Measure Type","Completion Date (DD/MM/YY)","Level of Certainty? (P= Purple, R=Red, A=Amber, G=Green","Abstraction Licence/ Permit, Obstruction ID or No Obstruction ID","Eastings","Northings","Investigation Type","Investigation Scope","Implementation Scope","Groundwater Measures Information","Name of SSSI \n(if applicable)","Name of N2K/Ramsar site \n(if applicable)","SSSI/N2K/Ramsar Unit ID","SSSI/N2K/Ramsar Area of Unit (Hectares)","Justification for Action/Investigation","Eel Priority Status","Eel Improvement Type ","Primary Type of Priority Habitat Created or Restored/Improved","Secondary Type of Priority Habitat Created or Restored/Improved","Other Priority Habitat Created or Restored/Improved","Type of Action Taken","Units Recorded (Hectare or km)","Number of Hectares or Kms","Name of Priority Species","Name of High Risk of Extinction Species","INNS Control Measure","INNS Species \n(if applicable)","Name of MCZ","Name of Bathing Water \n(where applicable)","Name of Shellfish Water \n(where applicable)","Chemical of Interest \n(for chemicals measures only)","Groundwater Chemicals","Drinking Water Inspectorate - Undertaking or Notice \nY/N","DrWPA Substances at Risk\n(if applicable)","Safeguard Zone Name \n(if applicable)","Safeguard Zone ID \n(if applicable)","Population Equivalent for STWs ","Current Permit Limit (mg/l)","Proposed Permit Limit (mg/l)","Proposed Iron or Aluminium Limits \n(for Phosphorus measures only)","Current DWF (m3/d)","Proposed DWF (m3/d) \n(if applicable)","Proposed Permit Limit Other","Catchment Measure Actions ","Unsustainable Abstraction System Code","Linked Groundwater Body Name","Linked Groundwater Body ID","Licence Category","Water Resource Zone \n(WRZ)","WR HMWB Flag  \n(X)","Scheme Relates to Following Missing Mitigation Measures \n(HMWB only)","Annual Licence Volume (Ml/a)","Daily Licence Volume (Ml/d)","Aggregate Licence (x)","Sustainability Change (to Annual Licence Volume) \nMl/a","Sustainability Change (to Daily Licence Volume) \nMl/d","Sustainability Change (to HoF Condition) \nMl/d","*NEW* \nWater returned to the environment (Reduction in actual abstraction) ML/d","New Annual Licence Volume \n(Ml/a)","New Daily Licence Volume \n(Ml/d)","New HoF Condition \n(Ml/d)","Quantitative\nKm River Length Improved or Protected ","Quantitative\nArea (km2) Improved or Protected","Volume (Ml/yr) Drinking Water Protected","Hectares of Designated Site (HD/RAMSAR/\nSSSI) Restored or Improved","*NEW* \nINNS ,No Det outcome - Km2 of land with reduced risk of INNS","Delivers Additional FCERM Benefits \n(Y/N)","Delivers on Salmon 5-Point Action Plan","Additional Comments","CPS Reference","Flow Categorisation\n1= PR19 Synergy\n2= WFD failure\n3= Neither","Allowed totex unit rate","Quantity proposed in PR19 FD","Quantity Delivered","1 = In PR19, funded\n0 = In PR19, not funded","Price Control","Unit","Unit Conversion to £m","Changes made by company July 23 - please add comments on any changes"]
["EMD00013",null,null,null,null,"WR","Humber","East Midlands","Anglian Water Services Ltd","7AW100069","River Poulter - Elkesley boreholes (1,2,3,4,5,6,7)","Poulter from Millwood Brook to Maun","GB104028058140","River","Idle River",null,null,null,"WFD_IMP_WRFlow",null,null,null,null,null,"Sustainability Change","2024-12-22","Amber","03/28/73/0001",466300,376000,null,null,null,null,null,null,null,null,null,null,null,null,null,null,null,null,null,"",null,null,null,null,null,null,null,null,null,null,null,null,null,null,null,null,null,null,null,null,"PRJ-MI31","Idle Torne - PT Sandstone Nottinghamshire&Doncaster","GB40401G301500","CAT 2","West Lincolnshire",null,null,8296.4500000000007,27.276,"X",3577.45,"14.3 Ml/d",null,null,4719,12.9,null,8,null,null,null,null,null,null,"Options Appraisal has now been finalised and the preferred option after the CBA process is for reduction in abstraction from Elkesley by 6 Ml/d from RA which gives band 1 compliance in both the Poulter and the Idle. The abstraction would be replaced using headroom at the other AWS NEP sources. Elkesley licence would be reduced to 12.9 Ml/d (current RA is 18.9 Ml/d) and 4719 Ml/yr (not taking into account aggregates)"]
["EMD00014",null,null,null,null,"WR","Humber","East Midlands","Anglian Water Services Ltd","7AW100070","River Idle from Maun/Poulter to Tiln (Ordsall BOREHOLES 1,2 and Whisker Hill)","Idle from Maun/Poulter to Tiln","GB104028058091","River","Idle River",null,null,null,"WFD_IMP_WRFlow",null,null,null,null,null,"Sustainability Change","2024-12-22","Amber","03/28/74/0003",469550,380160,null,null,null,null,null,null,null,null,null,null,null,null,null,null,null,null,null,"",null,null,null,null,null,null,null,null,null,null,null,null,null,null,null,null,null,null,null,null,null,"Idle Torne - PT Sandstone Nottinghamshire&Doncaster","GB40401G301500","CAT 2","West Lincolnshire",null,null,4977.87,16.37,"X","No change","No change",null,null,null,null,null,null,null,null,null,null,null,null,"Options Appraisal has now been finalised and the preferred option after the CBA process is for reduction in abstraction from Elkesley by 6 Ml/d from RA which gives band 1 compliance in both the Poulter and the Idle. The abstraction would be replaced using headroom at the other AWS NEP sources. Elkesley licence would be reduced to 12.9 Ml/d (current RA is 18.9 Ml/d) and 4719 Ml/yr (not taking into account aggregates)"]
["EMD00015",null,null,null,null,"WR","Humber","East Midlands","Anglian Water Services Ltd","7AW100070","River Idle from Maun/Poulter to Tiln (Grove BOREHOLES 1,2,3,4)","Idle from Maun/Poulter to Tiln","GB104028058091","River","Idle River",null,null,null,"WFD_IMP_WRFlow",null,null,null,null,null,"Sustainability Change","2024-12-22","Amber","03/28/74/0005",474100,380300,null,null,null,null,null,null,null,null,null,null,null,null,null,null,null,null,null,"",null,null,null,null,null,null,null,null,null,null,null,null,null,null,null,null,null,null,null,null,null,"Idle Torne - PT Sandstone Nottinghamshire&Doncaster","GB40401G301500","CAT 2","West Lincolnshire",null,null,4977.87,16.37,"X","No change","No change",null,null,null,null,null,null,null,null,null,null,null,null,"Options Appraisal has now been finalised and the preferred option after the CBA process is for reduction in abstraction from Elkesley by 6 Ml/d from RA which gives band 1 compliance in both the Poulter and the Idle. The abstraction would be replaced using headroom at the other AWS NEP sources. Elkesley licence would be reduced to 12.9 Ml/d (current RA is 18.9 Ml/d) and 4719 Ml/yr (not taking into account aggregates)"]
["EMD00016",null,null,null,null,"WR","Humber","East Midlands","Anglian Water Services Ltd","7AW100071","Idle from Ryton to Trent - Everton boreholes (1,2,3,4,5,6)","Idle from Ryton to Trent","GB104028058110","River","Idle River",null,null,null,"WFD_IMP_WRFlow",null,null,null,null,null,"Sustainability Change","2024-12-22","Amber","03/28/74/0004",469103,390507,null,null,null,null,null,null,null,null,null,null,null,null,null,null,null,null,null,"",null,null,null,null,null,null,null,null,null,null,null,null,null,null,null,null,null,null,null,null,null,"Idle Torne - PT Sandstone Nottinghamshire&Doncaster","GB40401G301500","CAT 2","West Lincolnshire",null,null,"4150.498",13.638,"X","No change","No change",null,null,null,null,null,null,null,null,null,null,null,null,"Options Appraisal has now been finalised and the preferred option after the CBA process is for reduction in abstraction from Elkesley by 6 Ml/d from RA which gives band 1 compliance in both the Poulter and the Idle. The abstraction would be replaced using headroom at the other AWS NEP sources. Elkesley licence would be reduced to 12.9 Ml/d (current RA is 18.9 Ml/d) and 4719 Ml/yr (not taking into account aggregates)"]
["EAN00363","Changed",null,null,null,"WR","Anglian","East Anglia","Anglian Water Services Ltd","7AW100085","Implementation Scheme: Undertake river restoration to mitigate the effects of abstraction. The river restoration project will be planned to ensure good biosecurity practices are observed, pathways of spread of invasive species are mitigated and the resultant project brings about biodiversity enhancements.","Old Carr Stream","GB105033047820","River","Wissey",null,null,null,"WFD_IMP_WRFlow",null,"INNS_ND","INNS","NERC_IMP1","Land Management / Physical Improvement","Land Management/ Habitat Restoration/ Physical Improvement","2024-12-22","Amber",null,null,null,null,null,"In channel restoration measures",null,null,null,null,null,null,null,null,null,null,"riverine habitats and species ","Restore habitat features",null,null,"",null,"Pathways of spread – other",null,null,null,null,null,null,null,null,null,null,null,null,null,null,null,null,null,null,null,null,null,null,null,null,null,null,null,null,null,null,null,null,null,null,null,4,null,null,null,null,null,null,"Linked to WR AMP6 Options Appraisal work where river restoration will be conducted in combination with licence caps.  Any river support required would be in  AMP8.",null,null,0.109,1,1,1,"WR","£m",1]
["EAN00364","Changed",null,null,null,"WR","Anglian","East Anglia","Anglian Water Services Ltd","7AW100085","Implementation Scheme: Undertake river restoration to mitigate the effects of abstraction. The river restoration project will be planned to ensure good biosecurity practices are observed, pathways of spread of invasive species are mitigated and the resultant project brings about biodiversity enhancements.","Gadder","GB105033047880","River","Wissey",null,null,null,"WFD_IMP_WRFlow",null,"INNS_ND","INNS","NERC_IMP1","Land Management / Physical Improvement","Land Management/ Habitat Restoration/ Physical Improvement","2024-12-22","Amber",null,null,null,null,null,"In channel and marginal restoration measures ",null,null,null,null,null,null,null,null,null,null,"riverine habitats and species ","Restore habitat features",null,null,"",null,"Pathways of spread – other",null,null,null,null,null,null,null,null,null,null,null,null,null,null,null,null,null,null,null,null,null,null,null,null,null,null,null,null,null,null,null,null,null,null,null,10.388999999999999,null,null,null,null,null,null,"Linked to WR AMP6 Options Appraisal work where river restoration will be conducted in combination with licence caps.",null,null,0.312,1,1,1,"WR","£m",1]
["EAN00365","Changed",null,null,null,"WR","Anglian","East Anglia","Anglian Water Services Ltd","7AW100085","Implementation Scheme: Undertake river restoration to mitigate the effects of abstraction. The river restoration project will be planned to ensure good biosecurity practices are observed, pathways of spread of invasive species are mitigated and the resultant project brings about biodiversity enhancements.","Stringside Stream","GB105033047810","River","Wissey",null,null,null,"WFD_IMP_WRFlow",null,"INNS_ND","INNS","NERC_IMP1","Land Management / Physical Improvement","Land Management/ Habitat Restoration/ Physical Improvement","2024-12-22","Amber",null,null,null,null,null,"In channel restoration measures",null,null,null,null,null,null,null,null,null,null,"riverine habitats and species ","Restore habitat features",null,null,"",null,"Pathways of spread – other",null,null,null,null,null,null,null,null,null,null,null,null,null,null,null,null,null,null,null,null,null,null,null,null,null,null,null,null,null,null,null,null,null,null,null,5.5,null,null,null,null,null,null,"Linked to WR AMP6 Options Appraisal work where river restoration will be conducted in combination with licence caps.  Any river support required would be in  AMP8.",null,null,0.33300000000000002,1,1,1,"WR","£m",1]
["EAN00109","Changed",null,null,null,"WR","Anglian","East Anglia","Anglian Water Services Ltd","7AW100086","Birchmoor","Broughton Brook","GB105033037930","River","Ouzel and Milton Keynes",null,null,null,"WFD_IMP_WRFlow",null,null,null,null,null,"Sustainability Change","2024-12-22","Amber","6/33/09/*G/0003",494370,234760,null,null,"Flow improvement by river support taken from capped quantities. (Deterioration prevented by capping licence quantity to max peak 2005-15  itemised separately under WFD_ND_WRFlow for Broughton Brook).",null,null,null,null,null,null,null,null,null,null,null,null,null,null,"",null,null,null,null,null,null,null,null,null,null,null,null,null,null,null,null,null,null,null,null,"PRJ_AN66","Upper Bedford Ouse Woburn Sands","GB40501G402200","CAT 2","Ruthamford South",null,null,2489,9.5,null,547.5,1.5,null,null,1800.5,4.9329999999999998,null,15,null,null,null,null,null,null,"The sustainability change is the quantity to provide river support from recenly abstracted quantities.  The quantity in column CA is the new licence volume as a result of reductions for river support and no deterioration, and is the quantity available for public water supply.  If supporting the river from full licensed quantities can be shown not to cause deterioration to the groundwater body or neighbouring surface water bodies, the sustainability change will be less.  Daily qs in BY & CB calculated from annual qs, but unlikely to be licence changes in reality.  ",null,null,1.3959999999999999,1,1,1,"WR","£m",1]
["EAN00359","Changed",null,null,null,"WR","Anglian","East Anglia","Anglian Water Services Ltd","7AW100086","Implementation Scheme: Undertake river restoration to mitigate the effects of abstraction. The river restoration project will be planned to ensure good biosecurity practices are observed, pathways of spread of invasive species are mitigated and the resultant project brings about biodiversity enhancements.","Broughton Brook","GB105033037930","River","Ouzel and Milton Keynes",null,null,null,"WFD_IMP_WRFlow",null,"INNS_ND","INNS","NERC_IMP1","Land Management / Physical Improvement","Land Management/ Habitat Restoration/ Physical Improvement","2024-12-22","Amber",null,null,null,null,null,"In channel and marginal restoration measures ",null,null,null,null,null,null,null,null,null,null,"Riverine Habitats and species","Restore habitat features",null,null,"",null,"Pathways of spread – other",null,null,null,null,null,null,null,null,null,null,null,null,null,null,null,null,null,null,null,null,null,null,null,null,null,null,null,null,null,null,null,null,null,null,null,18.5,null,null,null,null,null,null,"Linked to WR AMP6 Options Appraisal work where river restoration will be conducted in combination with licence caps and river support scheme.",null,null,9.8000000000000004E-2,1,1,1,"WR","£m",1]
["EAN02383","Addition",null,null,null,"WR","Anglian","East Anglia","Anglian Water Services Ltd","7AW100087","Implementation Scheme: Undertake river restoration to mitigate the effects of abstraction. The river restoration project will be planned to ensure good biosecurity practices are observed, pathways of spread of invasive species are mitigated and the resultant project brings about biodiversity enhancements.","Tuddenham Stream","GB105033043010","River","Lark",null,null,null,"WFD_IMP_WRFlow",null,"INNS_ND","INNS","NERC_IMP1","Land Management / Physical Improvement","Land Management/ Habitat Restoration/ Physical Improvement","2024-12-22","Amber",null,null,null,null,null,"In channel and marginal restoration measures",null,null,null,null,null,null,null,null,null,null,"riverine habitats and species ","Restore habitat features",null,null,null,null,"Pathways of spread – other",null,null,null,null,null,null,null,null,null,null,null,null,null,null,null,null,null,null,null,null,null,null,null,null,null,null,null,null,null,null,null,null,null,null,null,3.7290000000000001,null,null,null,null,null,null,"Linked to WR AMP6 Options Appraisal work where river restoration will be conducted in combination with licence caps.",null,null,0.59499999999999997,1,1,1,"WR","£m",1]
["EAN02384","Addition",null,null,null,"WR","Anglian","East Anglia","Anglian Water Services Ltd","7AW100087","Implementation Scheme: Undertake river restoration to mitigate the effects of abstraction. The river restoration project will be planned to ensure good biosecurity practices are observed, pathways of spread of invasive species are mitigated and the resultant project brings about biodiversity enhancements.","Cavenham Stream","GB105033043000","River","Lark",null,null,null,"WFD_IMP_WRFlow",null,"INNS_ND","INNS","NERC_IMP1","Land Management / Physical Improvement","Land Management/ Habitat Restoration/ Physical Improvement","2024-12-22","Amber",null,null,null,null,null,"In channel and marginal restoration measures",null,null,null,null,null,null,null,null,null,null,"riverine habitats and species ","Restore habitat features",null,null,null,null,"Pathways of spread – other",null,null,null,null,null,null,null,null,null,null,null,null,null,null,null,null,null,null,null,null,null,null,null,null,null,null,null,null,null,null,null,null,null,null,null,11,null,null,null,null,null,null,"Linked to WR AMP6 Options Appraisal work where river restoration will be conducted in combination with licence caps.  Any river support required would be in AMP8.",null,null,0.626,1,1,1,"WR","£m",1]
["EAN00114","Changed",null,null,null,"WR","Anglian","East Anglia","Anglian Water Services Ltd","7AW100088","Isleham","Kennett - Lee Brook","GB105033043020","River","Lark",null,null,null,"WFD_IMP_WRFlow",null,null,null,null,null,"Sustainability Change","2024-12-22","Amber","6/33/39/*G/0008",564061,272963,null,null,"Flow improvement by river support taken from capped quantities.  (Deterioration prevented by capping licence quantity to max peak 2005-15  itemised separately under WFD_ND_WRFlow for Kennett-Lee Brook). ",null,null,null,null,null,null,null,null,null,null,null,null,null,null,"",null,null,null,null,null,null,null,null,null,null,null,null,null,null,null,null,null,null,null,null,"PRJ_AN55","Cam and Ely Ouse Chalk","GB40501G400500","CAT 2","ELY",null,null,1650,5.7,null,562.1,1.54,null,null,805.9,2.2080000000000002,null,4.0030000000000001,null,null,null,null,null,null,"The sustainability change is the quantity to provide river support from recenly abstracted quantities.  The quantity in column CA is the new licence volune as a result of reductions for river support and no deterioration, and is the quantity available for public water supply.  If supporting the river from full licensed quantities can be shown not to cause deterioration to the groundwater body or neighbouring surface water bodies, the sustainability change will be less.  Daily qs in BY & CB calculated from annual qs, but unlikely to be licence changes in reality.  ",null,null,1.55,1,1,1,"WR","£m",1]
["EAN00361","Changed",null,null,null,"WR","Anglian","East Anglia","Anglian Water Services Ltd","7AW100088","Implementation Scheme: Undertake river restoration to mitigate the effects of abstraction. The river restoration project will be planned to ensure good biosecurity practices are observed, pathways of spread of invasive species are mitigated and the resultant project brings about biodiversity enhancements.","Kennett - Lee Brook","GB105033043020","River","Lark",null,null,null,"WFD_IMP_WRFlow",null,"INNS_ND","INNS","NERC_IMP1","Land Management / Physical Improvement","Land Management/ Habitat Restoration/ Physical Improvement","2024-12-22","Amber",null,null,null,null,null,"In channel restoration measures",null,null,null,null,null,null,null,null,null,null,"Riverine Habitats and species","Restore habitat features",null,null,"",null,"Pathways of spread – other",null,null,null,null,null,null,null,null,null,null,null,null,null,null,null,null,null,null,null,null,null,null,null,null,null,null,null,null,null,null,null,null,null,null,null,4.0030000000000001,null,null,null,null,null,null,"Linked to WR AMP6 Options Appraisal work where river restoration will be conducted in combination with licence caps and river support scheme.",null,null,0.308,1,1,1,"WR","£m",1]
["EAN00129","Changed",null,null,null,"WR","Anglian","East Anglia","Anglian Water Services Ltd","7AW100090","Rushbrooke","Linnet","GB105033042950","River","Lark",null,null,null,"WFD_IMP_WRFlow",null,null,null,null,null,"Sustainability Change","2024-12-22","Amber","6/33/37/*G/0200",587320,262350,null,null,"Flow improvement by river support taken from capped quantities.  (Deterioration prevented by capping licence quantity to max peak 2005-15  itemised separately under WFD_ND_WRFlow for Linnet.) ",null,null,null,null,null,null,null,null,null,null,null,null,null,null,"",null,null,null,null,null,null,null,null,null,null,null,null,null,null,null,null,null,null,null,null,"PRJ_AN59","Cam and Ely Ouse Chalk","GB40501G400500","CAT 2","WEST SUFFOLK",null,null,2250,8.1999999999999993,null,365,1,null,null,1547,4.2380000000000004,null,4.3,null,null,null,null,null,null,"The sustainability change is the quantity to provide river support from recenly abstracted quantities.  The quantity in column CA is the new licence volune as a result of reductions for river support and no deterioration, and is the quantity available for public water supply.  If supporting the river from full licensed quantities can be shown not to cause deterioration to the groundwater body or neighbouring surface water bodies, the sustainability change will be less.  Daily qs in BY & CB calculated from annual qs, but unlikely to be licence changes in reality.  ",null,null,1.1339999999999999,1,1,1,"WR","£m",1]
["EAN00360","Changed",null,null,null,"WR","Anglian","East Anglia","Anglian Water Services Ltd","7AW100090","Implementation Scheme: Undertake river restoration to mitigate the effects of abstraction. The river restoration project will be planned to ensure good biosecurity practices are observed, pathways of spread of invasive species are mitigated and the resultant project brings about biodiversity enhancements.","Linnet","GB105033042950","River","Lark",null,null,null,"WFD_IMP_WRFlow",null,"INNS_ND","INNS","NERC_IMP1","Land Management / Physical Improvement","Land Management/ Habitat Restoration/ Physical Improvement","2024-12-22","Amber",null,null,null,null,null,"In channel and marginal restoration measures ",null,null,null,null,null,null,null,null,null,null,"Riverine Habitats and species","Restore habitat features",null,null,"",null,"Pathways of spread – other",null,null,null,null,null,null,null,null,null,null,null,null,null,null,null,null,null,null,null,null,null,null,null,null,null,null,null,null,null,null,null,null,null,null,null,4,null,null,null,null,null,null,"Linked to WR AMP6 Options Appraisal work where river restoration will be conducted in combination with licence caps and river support schemes.",null,null,0.317,1,1,1,"WR","£m",1]
["EAN00366","Changed",null,null,null,"WR","Anglian","East Anglia","Anglian Water Services Ltd","7AW100091","Implementation Scheme: Undertake river restoration to mitigate the effects of abstraction. The river restoration project will be planned to ensure good biosecurity practices are observed, pathways of spread of invasive species are mitigated and the resultant project brings about biodiversity enhancements.","Gaywood River","GB105033047680","River","North West Norfolk Rivers",null,null,null,"WFD_IMP_WRFlow",null,"INNS_ND","INNS","NERC_IMP1","Land Management / Physical Improvement","Land Management/ Habitat Restoration/ Physical Improvement","2024-12-22","Amber",null,null,null,null,null,"In channel and marginal restoration measures ",null,null,null,null,null,null,null,null,null,null,"riverine habitats and species ","Restore habitat features",null,null,"",null,"Pathways of spread – other",null,null,null,null,null,null,null,null,null,null,null,null,null,null,null,null,null,null,null,null,null,null,null,null,null,null,null,null,null,null,null,null,null,null,null,7.25,null,null,null,null,null,null,"Linked to WR AMP6 Options Appraisal work where river restoration will be conducted in combination with licence caps.",null,null,0.45800000000000002,1,1,1,"WR","£m",1]
["EAN00367","Changed",null,null,null,"WR","Anglian","East Anglia","Anglian Water Services Ltd","7AW100092","Implementation Scheme: Undertake river restoration to mitigate the effects of abstraction. The river restoration project will be planned to ensure good biosecurity practices are observed, pathways of spread of invasive species are mitigated and the resultant project brings about biodiversity enhancements.","River Heacham","GB105033053480","River","North West Norfolk Rivers",null,null,null,"WFD_IMP_WRFlow",null,"INNS_ND","INNS","NERC_IMP1","Land Management / Physical Improvement","Land Management/ Habitat Restoration/ Physical Improvement","2024-12-22","Amber",null,null,null,null,null,"In channel and marginal restoration measures ",null,null,null,null,null,null,null,null,null,null,"riverine habitats and species ","Restore habitat features",null,null,"",null,"Pathways of spread – other",null,null,null,null,null,null,null,null,null,null,null,null,null,null,null,null,null,null,null,null,null,null,null,null,null,null,null,null,null,null,null,null,null,null,null,5.3,null,null,null,null,null,null,"Linked to WR AMP6 Options Appraisal work where river restoration will be conducted in combination with licence caps already in place.",null,null,0.31,1,1,1,"WR","£m",1]
["EAN00133","Changed",null,null,null,"WR","Anglian","East Anglia","Anglian Water Services Ltd","7AW100093","Stanton/Ixworth","Sapiston River","GB105033043070","River","Little Ouse and Thet",null,null,null,"WFD_IMP_WRFlow",null,null,null,null,null,"Sustainability Change","2024-12-22","Amber","6/33/41/*G/0165",594000,269640,null,null,"Flow improvement by river support taken from capped quantities.  (Deterioration prevented by capping licence quantity to max peak 2005-15  itemised separately under WFD_ND_WRFlow for Sapiston River). ",null,null,null,null,null,null,null,null,null,null,null,null,null,null,"",null,null,null,null,null,null,null,null,null,null,null,null,null,null,null,null,null,null,null,null,"PRJ-AN64","Cam and Ely Ouse Chalk","GB40501G400500","CAT 2","WEST SUFFOLK",null,null,2953.33,10,null,653.35,1.79,null,null,1178.6500000000001,3.23,null,11.9,null,null,null,null,null,null,"The sustainability change is the quantity to provide river support from recenly abstracted quantities.  The quantity in column CA is the new licence volume as a result of reductions for river support and no deterioration, and is the quantity available for public water supply.  If supporting the river from full licensed quantities can be shown not to cause deterioration to the groundwater body or neighbouring surface water bodies, the sustainability change will be less.  NB the licence already has provision for the greater q of 1460 Ml/yr for discharge into the Sapiston River.  Daily qs in BY & CB calculated from annual qs, but unlikely to be licence changes in reality.",null,null,0.72799999999999998,1,1,1,"WR","£m",1]
["EAN02388","Addition",null,null,null,"WR","Anglian","East Anglia","Anglian Water Services Ltd","7AW100093","Implementation Scheme: Undertake river restoration to mitigate the effects of abstraction. The river restoration project will be planned to ensure good biosecurity practices are observed, pathways of spread of invasive species are mitigated and the resultant project brings about biodiversity enhancements.","Sapiston River","GB105033043070","River","Little Ouse and Thet",null,null,null,"WFD_IMP_WRFlow",null,"INNS_ND","INNS","NERC_IMP1","Land Management / Physical Improvement","Land Management/ Habitat Restoration/ Physical Improvement","2024-12-22","Amber",null,null,null,null,null,"In channel and marginal restoration measures",null,null,null,null,null,null,null,null,null,null,"riverine habitats and species ","Restore habitat features",null,null,null,null,"Pathways of spread – other",null,null,null,null,null,null,null,null,null,null,null,null,null,null,null,null,null,null,null,null,null,null,null,null,null,null,null,null,null,null,null,null,null,null,null,10.475,null,null,null,null,null,null,"Linked to WR AMP6 Options Appraisal work where river restoration will be conducted in combination with licence caps and river support schemes.",null,null,0.39500000000000002,1,1,1,"WR","£m",1]
["EAN02389","Addition",null,null,null,"WR","Anglian","East Anglia","Anglian Water Services Ltd","7AW100093","Implementation Scheme: Undertake river restoration to mitigate the effects of abstraction. The river restoration project will be planned to ensure good biosecurity practices are observed, pathways of spread of invasive species are mitigated and the resultant project brings about biodiversity enhancements.","Stowlangtoft Stream","GB105033043340","River","Little Ouse and Thet",null,null,null,"WFD_IMP_WRFlow",null,"INNS_ND","INNS","NERC_IMP1","Land Management / Physical Improvement","Land Management/ Habitat Restoration/ Physical Improvement","2024-12-22","Amber",null,null,null,null,null,"In channel and marginal restoration measures",null,null,null,null,null,null,null,null,null,null,"riverine habitats and species ","Restore habitat features",null,null,null,null,"Pathways of spread – other",null,null,null,null,null,null,null,null,null,null,null,null,null,null,null,null,null,null,null,null,null,null,null,null,null,null,null,null,null,null,null,null,null,null,null,12,null,null,null,null,null,null,"Linked to WR AMP6 Options Appraisal work where river restoration will be conducted in combination with licence caps and river support schemes.",null,null,0.441,1,1,1,"WR","£m",1]
["EAN02390","Addition",null,null,null,"WR","Anglian","East Anglia","Anglian Water Services Ltd","7AW100093","Stanton/Ixworth","Stowlangtoft Stream","GB105033043340","River","Little Ouse and Thet",null,null,null,"WFD_IMP_WRFlow",null,null,null,null,null,"Sustainability Change","2024-12-22","Amber","6/33/41/*G/0165",594000,269640,null,null,"Flow improvement by river support taken from capped quantities.  (Deterioration prevented by capping licence quantity to max peak 2005-15  itemised separately under WFD_ND_WRFlow for Stowlangtoft Stream). ",null,null,null,null,null,null,null,null,null,null,null,null,null,null,null,null,null,null,null,null,null,null,null,null,null,null,null,null,null,null,null,null,null,null,null,"PRJ_AN65","Cam and Ely Ouse Chalk","GB40501G400500","CAT 2","WEST SUFFOLK",null,null,2953.33,10,null,259.14999999999998,0.71,null,null,1572.85,4.3099999999999996,null,4.4000000000000004,null,null,null,null,null,null,"The sustainability change is the quantity to provide river support from recenly abstracted quantities.  The quantity in column CA is the new licence volume as a result of reductions for river support and no deterioration, and is the quantity available for public water supply.  If supporting the river from full licensed quantities can be shown not to cause deterioration to the groundwater body or neighbouring surface water bodies, the sustainability change will be less. NB the licence already has provision for the greater q of 1460 Ml/yr for discharge into the Sapiston River.  The sustainability change is to the same licence, Ixworth/Stanton, as for Sapiston River. Daily qs in BY & CB calculated from annual qs, but unlikely to be licence changes in reality.",null,null,0.41099999999999998,1,1,1,"WR","£m",1]
["EAN02414","Addition",null,null,null,"WR","Anglian","East Anglia","Anglian Water Services Ltd","7AW100093","Stanton/Ixworth","Sapiston","GB105033043280","River","Little Ouse and Thet",null,null,null,"WFD_IMP_WRFlow",null,null,null,null,null,"Sustainability Change","2024-12-23","Amber","6/33/41/*G/0165",594000,269640,null,null,"Flow improvement by river support taken from capped quantities.  (Deterioration prevented by capping licence quantity to max peak 2005-15  itemised separately under WFD_ND_WRFlow for Sapiston). ",null,null,null,null,null,null,null,null,null,null,null,null,null,null,null,null,null,null,null,null,null,null,null,null,null,null,null,null,null,null,null,null,null,null,null,null,"Cam and Ely Ouse Chalk","GB40501G400500","CAT 2","WEST SUFFOLK",null,null,2953.33,10,null,259.14999999999998,0.71,null,null,1572.85,4.3099999999999996,null,1.8,null,null,null,null,null,null,"The sustainability change is the quantity to provide river support from recenly abstracted quantities.  The quantity in column CA is the new licence volume as a result of reductions for river support and no deterioration, and is the quantity available for public water supply.   If supporting the river from full licensed quantities can be shown not to cause deterioration to the groundwater body or neighbouring surface water bodies, the sustainability change will be less.  NB the licence already has provision for the greater q of 1460 Ml/yr for discharge into the Sapiston River.  The sustainability change is to the same licence, Ixworth/Stanton, as for Sapiston River. Daily qs in BY & CB calculated from annual qs, but unlikely to be licence changes in reality.  The support for this section of the upper Sapiston is from the same discharge as the support for the Stowlangtoft Stream, as it is downstream of the confluence with the Stowlangtoft Stream.",null,null,0.41099999999999998,1,1,1,"WR","£m",1]
["EAN00136","Changed",null,null,null,"WR","Anglian","East Anglia","Anglian Water Services Ltd","7AW100270","WEST RUNTON COMMON / West Runton, Sheringham","North Norfolk Chalk","GB40501G400100","Groundwater","North Norfolk Chalk",null,null,null,"NERC_IMP2","Other",null,null,null,null,"Sustainability Change","2025-03-31","Amber","AN/034/005/010",null,null,null,null,"To implement the conclusions of the AMP6 Investigation/Options Appraisal : this is likley to be habitat restoration/compensation dischrge to mitigate for the drawdown impacts of abstraction, but could involve the relocation of the source.","GW Category 2",null,null,null,null,null,null,null,"Pond",null,null,"Restore habitat features",null,null,"",null,null,null,null,null,null,null,null,null,null,null,null,null,null,null,null,null,null,null,null,null,"North Norfolk Chalk","GB40501G400100","BLANK","North Norfolk Coast",null,null,null,null,null,null,null,null,null,null,null,null,null,5.0000000000000001E-3,null,null,null,null,null,"This relates to the borehole constructed at West Runton to reduce the impacts of groundwater abstraction at Sheringham and Beeston Regis Common. An investigation has shown that the West Runton borehole is affecting the ponds and other wetland habitats at West Runton Common County Wildlife Site. This project will implement measures to reduce/remove the impacts of abstraction on the County Wildlife Site.",null,null,0.48399999999999999,1,1,1,"WR","£m",1]
["EAN00138","Changed",null,null,null,"WR","Anglian","East Anglia","Anglian Water Services Ltd","7AW100272","TIFFEY / High Oak","Hackford Watercourse","GB105034051200","River","Yare",null,null,null,"WFD_IMP_WRFlow",null,null,null,null,null,"Sustainability Change","2024-12-22","Amber","7/34/13/*G/0163",null,null,null,null,"Flow improvement by river support taken from capped quantities.  (Deterioration prevented by capping licence quantity to max peak 2005-15  itemised separately under WFD_ND_WRFlow for Hackford Watercourse). ",null,null,null,null,null,null,null,null,null,null,null,null,null,null,"",null,null,null,null,null,null,null,null,null,null,null,null,null,null,null,null,null,null,null,null,null,"Broadland Rivers Chalk & Crag","GB40501G400300","CAT 2","Norfolk Rural",null,null,2727.6,10.91,null,null,2.9,null,null,null,6.7,null,7.68,null,null,null,null,null,null,"The sustainability change is the quantity to provide river support from recenly abstracted quantities.  The quantity in column CA is the new licence volune as a result of reductions for river support and no deterioration, and is the quantity available for public water supply.  If supporting the river from full licensed quantities can be shown not to cause deterioration to the groundwater body or neighbouring surface water bodies, the sustainability change will be less.   Figure in CB derived by removing daily river support requirement from capped daily licence volume in ND line. Thi squantity only available for PWS.",null,null,1.125,1,1,1,"WR","£m",1]
["EAN00139","Changed",null,null,null,"WR","Anglian","East Anglia","Anglian Water Services Ltd","7AW100272","TIFFEY / High Oak","Tiffey (u/s Wymondham STW)","GB105034051180","River","Yare",null,null,null,"WFD_IMP_WRFlow",null,null,null,null,null,"Sustainability Change","2024-12-22","Amber","7/34/13/*G/0163",null,null,null,null,"Flow improvement by river support taken from capped quantities.  (Deterioration prevented by capping licence quantity to max peak 2005-15  itemised separately under WFD_ND_WRFlow for Tiffey u/s Wymondham).",null,null,null,null,null,null,null,null,null,null,null,null,null,null,"",null,null,null,null,null,null,null,null,null,null,null,null,null,null,null,null,null,null,null,null,null,"Broadland Rivers Chalk & Crag","GB40501G400301","CAT 2","Norfolk Rural",null,null,2727.6,10.91,null,null,2.9,null,null,null,6.7,null,8.65,null,null,null,null,null,null,"The sustainability change is the quantity to provide river support from recenly abstracted quantities.  The quantity in column CA is the new licence volune as a result of reductions for river support and no deterioration, and is the quantity available for public water supply.  If supporting the river from full licensed quantities can be shown not to cause deterioration to the groundwater body or neighbouring surface water bodies, the sustainability change will be less.   Figure in CB derived by removing daily river support requirement from capped daily licence volume in ND line. Thi squantity only available for PWS.",null,null,1.125,1,1,1,"WR","£m",1]
["EAN00140","Changed",null,null,null,"WR","Anglian","East Anglia","Anglian Water Services Ltd","7AW100273","BRETT / Semer, Raydon","River Brett at confluence with Stour","GB105036040930","River","Stour OC",null,null,null,"WFD_IMP_WRFlow",null,null,null,null,null,"Sustainability Change","2024-12-22","Amber","8/36/17/*G/0093",null,null,null,null,"To implement the conclusions of preceeding Investigation/Options Appraisal in collaboration with Essex & Suffolk Water and Affinity Water : this is likely to involve habitat restoration/compensation discharge to mitigate for reduction n flows, but could involve a sustainability reduction.",null,null,null,null,null,null,null,null,null,null,null,null,null,null,"",null,null,null,null,null,null,null,null,null,null,null,null,null,null,null,null,null,null,null,null,null,"North Essex Chalk","GB40501G400700","CAT 1","East Suffolk",null,null,3213,19.2,null,null,4.3920000000000003,null,null,null,null,null,24.7,null,null,null,null,null,null,"Sust change updated 9.8.2017.  Taken from Anglian East SWB worksheet\nScheme affects multiple Water Companies"]
["EAN02422","Addition",null,null,null,"WR","Anglian","East Anglia","Anglian Water Services Ltd","7AW100273","BRETT / Semer, Raydon","River Brett at confluence with Stour","GB105036040930","River","Stour OC",null,null,null,"WFD_IMP_WRFlow",null,null,null,null,null,"Adaptive Management","2024-12-22","Amber","8/36/17/*G/0093",null,null,null,null,"To implement the conclusions of preceeding Investigation/Options Appraisal in collaboration with Essex & Suffolk Water and Affinity Water : this is likely to involve habitat restoration/compensation discharge to mitigate for reduction n flows, but could involve a sustainability reduction.",null,null,null,null,null,null,null,null,null,null,null,null,null,null,"",null,null,null,null,null,null,null,null,null,null,null,null,null,null,null,null,null,null,null,null,null,"North Essex Chalk","GB40501G400700","CAT 1","East Suffolk",null,null,3213,19.2,null,null,null,null,null,null,null,null,24.7,null,null,null,null,null,null,"Sustainability reduction may not be required if other appropriate management actions are identified as a result of OA."]
["LNA00001","Changed",null,null,null,"WR","Humber","Lincolnshire and Northamptonshire","Anglian Water Services Ltd","7AW101744","BARNOLDBY - BORES A - D","Grimsby Ancholme Louth Chalk Unit","GB40401G401500","Groundwater","Grimsby Ancholme Louth Chalk Unit",null,null,null,"WFDGW_IMP_GWR",null,"WFD_IMP_WRFlow",null,"WFDGW_ND_GWR",null,"Sustainability Change","2024-12-22","Amber","4/29/10/*G/0005",524450,403780,null,null,null,"GW Category 4",null,null,null,null,null,null,null,null,null,null,null,null,null,null,null,null,null,null,null,null,null,null,null,null,null,null,null,null,null,null,null,null,null,null,"PRJ-AN45","Grimsby Ancholme Louth Chalk Unit","GB40401G401500",1,"East Lincolnshire",null,null,2099.0500000000002,5.75,"Yes",714.05,1.96,null,null,1385,3.79,null,1.67,null,null,null,null,null,null,"GB104029062110 Buck Beck from Source to N Sea.; GB104029067530 Laceby Beck/River Freshney Catchment; GB104029062100 Waithe beck lower catchment.  RA Cap  & River support option from NEP options appraisal work for the Northern Chalk Scheme. SC is difference between FL and the 10 year peak cap. RSA licence so  upfront permit required in AMP6. NB: New Daily quantity (col CB)calculated by dividing New Annual Quantity (Provided from AW) by 365. Environmental Outcome info (col CD) - taken from the OA final submission report by AW (CBA section), split between relevant licences. Part of final cost beneficial bundle of measures for the operational catchment",null,null,0.217,1,1,1,"WR","£m",1]
["LNA00002","Changed",null,null,null,"WR","Humber","Lincolnshire and Northamptonshire","Anglian Water Services Ltd","7AW101744","WEELSBY BORES A - E","Grimsby Ancholme Louth Chalk Unit","GB40401G401500","Groundwater","Grimsby Ancholme Louth Chalk Unit",null,null,null,"WFDGW_IMP_GWR",null,"WFD_IMP_WRFlow",null,"WFDGW_ND_GWR",null,"Sustainability Change","2024-12-22","Amber","4/29/10/*G/0003",528580,405740,null,null,null,"GW Category 4",null,null,null,null,null,null,null,null,null,null,null,null,null,null,null,null,null,null,null,null,null,null,null,null,null,null,null,null,null,null,null,null,null,null,"PRJ-AN45","Grimsby Ancholme Louth Chalk Unit","GB40401G401500",1,"East Lincolnshire",null,null,4500,13.8,"Yes",636,3.2000000000000011,null,null,3864,10.6,null,1.67,null,null,null,null,null,null,"GB104029062110 Buck Beck from Source to N Sea.; GB104029067530 Laceby Beck/River Freshney Catchment; GB104029062100 Waithe beck lower catchment.  RA Cap  & River support option from NEP options appraisal work for the Northern Chalk Scheme. SC is difference between FL and the 10 year peak cap. RSA licence so upfront permit required in AMP6.NB: New Daily quantity (col CB)calculated by dividing New Annual Quantity (Provided from AW) by 365. Environmental Outcome info (col CD) - taken from the OA final submission report by AW (CBA section), split between relevant licences. Part of final cost beneficial bundle of measures for the operational catchment",null,null,0.217,1,1,1,"WR","£m",1]
["LNA00027","Changed",null,null,null,"WR","Humber","Lincolnshire and Northamptonshire","Anglian Water Services Ltd","7AW101744","TETNEY","Grimsby Ancholme Louth Chalk Unit","GB40401G401500","Groundwater","Grimsby Ancholme Louth Chalk Unit",null,null,null,"WFDGW_IMP_GWR",null,"WFD_IMP_WRFlow",null,"WFDGW_ND_GWR",null,"Sustainability Change","2024-12-22","Amber","4/29/11/*G/0001",531820,400940,null,null,null,"GW Category 4",null,null,null,null,null,null,null,null,null,null,null,null,null,null,null,null,null,null,null,null,null,null,null,null,null,null,null,null,null,null,null,null,null,null,"PRJ-AN45","Grimsby Ancholme Louth Chalk Unit","GB40401G401500",1,"East Lincolnshire",null,null,8296.6239999999998,22.73,"Yes",3002.6,8.23,null,null,5294,14.5,null,1.67,null,null,null,null,null,null,"GB104029062100 Waithe Beck Lower Catchment; GB104029062030 New Dike catchment (trib of Louth Canal).  NEP Options RA  CAP and RS for Northern Chalk Scheme.  SC is FL minus RA 10 year peak CAP.  RSA licence so upfront permit required in AMP6.NB: New Daily quantity (col CB)calculated by dividing New Annual Quantity (Provided from AW) by 365. Environmental Outcome info (col CD) - taken from the OA final submission report by AW (CBA section), split between relevant licences. Part of final cost beneficial bundle of measures for the operational catchment",null,null,0.217,1,1,1,"WR","£m",1]
["LNA00028","Changed",null,null,null,"WR","Humber","Lincolnshire and Northamptonshire","Anglian Water Services Ltd","7AW101744","FULSTOW - BORES 1 -2","Grimsby Ancholme Louth Chalk Unit","GB40401G401500","Groundwater","Grimsby Ancholme Louth Chalk Unit",null,null,null,"WFDGW_IMP_GWR",null,"WFD_IMP_WRFlow",null,"WFDGW_ND_GWR",null,"Sustainability Change","2024-12-22","Amber","4/29/11/*G/0196",531430,398010,null,null,null,"GW Category 4",null,null,null,null,null,null,null,null,null,null,null,null,null,null,null,null,null,null,null,null,null,null,null,null,null,null,null,null,null,null,null,null,null,null,"PRJ-AN45","Grimsby Ancholme Louth Chalk Unit","GB40401G401500",1,"East Lincolnshire",null,null,2074.1559999999999,5.6829999999999998,"Yes",907,2.4829999999999997,null,null,1167,3.2,null,1.67,null,null,null,null,null,null,"GB104029062030 New dike Catchment; GB104029062165 Land Dike Drain to Louth Canal.  NEP Options RA CAP and RS for Northern Chalk Scheme. SC is FL minus RA 10 year cap.  RSA licence so upfront permit required will be in AMP6. NB: New Daily quantity (col CB) calculated by dividing New Annual Quantity (Provided from AW) by 365. Environmental Outcome info (col CD) - taken from the OA final submission report by AW (CBA section), split between relevant licences. Part of final cost beneficial bundle of measures for the operational catchment.",null,null,0.217,1,1,1,"WR","£m",1]
["LNA00033","Changed",null,null,null,"WR","Humber","Lincolnshire and Northamptonshire","Anglian Water Services Ltd","7AW101744","HABROUGH - BORES 1 -3","Grimsby Ancholme Louth Chalk Unit","GB40401G401500","Groundwater","Grimsby Ancholme Louth Chalk Unit",null,null,null,"WFDGW_IMP_GWR",null,"WFD_IMP_WRFlow",null,"WFDGW_ND_GWR",null,"Sustainability Change","2024-12-22","Amber","4/29/09/*G/0001",525230,408590,null,null,null,"GW Category 4",null,null,null,null,null,null,null,null,null,null,null,null,null,null,null,null,null,null,null,null,null,null,null,null,null,null,null,null,null,null,null,null,null,null,"PRJ-AN45","Grimsby Ancholme Louth Chalk Unit","GB40401G401500",1,"East Lincolnshire",null,null,6637,36,"Yes",5169,31.98,null,null,1468,4.0199999999999996,null,3.8,null,null,null,null,null,null,"GB104029067655 Skitter Beck; GB104029067575 North Beck Drain ND.  NEP Options RA CAP and river Support for the Northern Chalk scheme.  SC is FL minus RA 10 year peak CAP.  RSA licence so upfront permit required in AMP6.NB: New Daily quantity (col CB)calculated by dividing New Annual Quantity (Provided from AW) by 365. Environmental Outcome info (col CD) - taken from the OA final submission report by AW (CBA section), split between relevant licences.. Part of final cost beneficial bundle of measures for the operational catchment",null,null,0.217,1,1,1,"WR","£m",1]
["LNA00034","Changed",null,null,null,"WR","Humber","Lincolnshire and Northamptonshire","Anglian Water Services Ltd","7AW101744","LITTLE LONDON - BORES 1 - 4","Grimsby Ancholme Louth Chalk Unit","GB40401G401500","Groundwater","Grimsby Ancholme Louth Chalk Unit",null,null,null,"WFDGW_IMP_GWR",null,null,null,"WFDGW_ND_GWR",null,"Sustainability Change","2024-12-22","Amber","4/29/09/*G/0003",518830,411430,null,null,null,"GW Category 4",null,null,null,null,null,null,null,null,null,null,null,null,null,null,null,null,null,null,null,null,null,null,null,null,null,null,null,null,null,null,null,null,null,null,"PRJ-AN45","Grimsby Ancholme Louth Chalk Unit","GB40401G401500",1,"East Lincolnshire",null,null,4978,18.184000000000001,"Yes",1279,8.0540000000000003,null,null,3699,10.130000000000001,null,1.67,null,null,null,null,null,null,"NEP Options RA Cap and RS for Northern Chalk Scheme.  SC = FL minus RA 10 year peak CAP. GW driver risk of Deterioration. RSA licence so upfront permit required will in AMP6.NB: New Daily quantity (col CB)calculated by dividing New Annual Quantity (Provided from AW) by 365. Environmental Outcome info (col CD) - taken from the OA final submission report by AW (CBA section), split between relevant licences. Part of final cost beneficial bundle of measures for the operational catchment",null,null,0.217,1,1,1,"WR","£m",1]
["LNA00035","Changed",null,null,null,"WR","Humber","Lincolnshire and Northamptonshire","Anglian Water Services Ltd","7AW101744","HEALING - BORES A-F","Grimsby Ancholme Louth Chalk Unit","GB40401G401500","Groundwater","Grimsby Ancholme Louth Chalk Unit",null,null,null,"WFDGW_IMP_GWR",null,null,null,"WFDGW_ND_GWR",null,"Sustainability Change","2024-12-22","Amber","4/29/09/*G/0004",521730,410900,null,null,null,"GW Category 4",null,null,null,null,null,null,null,null,null,null,null,null,null,null,null,null,null,null,null,null,null,null,null,null,null,null,null,null,null,null,null,null,null,null,"PRJ-AN45","Grimsby Ancholme Louth Chalk Unit","GB40401G401500",2,"East Lincolnshire",null,null,4978,20.457000000000001,"Yes",2880,14.707000000000001,null,null,2098,5.75,null,1.67,null,null,null,null,null,null,"NEP Options RA CAP and RS for Northern Chalk Scheme.  SC = FL minus RA 10 year peak CAP.  RSA licence so upfront permit required  in AMP6. NB: New Daily quantity (col CB)calculated by dividing New Annual Quantity (Provided from AW) by 365. Environmental Outcome info (col CD) - taken from the OA final submission report by AW (CBA section), split between relevant licence.. Part of final cost beneficial bundle of measures for the operational catchment",null,null,0.217,1,1,1,"WR","£m",1]
["LNA00036","Changed",null,null,null,"WR","Humber","Lincolnshire and Northamptonshire","Anglian Water Services Ltd","7AW101744","THORNTON CURTIS - BORES 1-3","Grimsby Ancholme Louth Chalk Unit","GB40401G401500","Groundwater","Grimsby Ancholme Louth Chalk Unit",null,null,null,"WFDGW_IMP_GWR",null,"WFD_IMP_WRFlow",null,"WFDGW_ND_GWR",null,"Sustainability Change","2024-12-22","Amber","4/29/09/*G/0041",512470,417880,null,null,null,"GW Category 4",null,null,null,null,null,null,null,null,null,null,null,null,null,null,null,null,null,null,null,null,null,null,null,null,null,null,null,null,null,null,null,null,null,null,"PRJ-AN45","Grimsby Ancholme Louth Chalk Unit","GB40401G401500",1,"Central Lincolnshire",null,null,3700,13.638999999999999,"Yes",112,3.8089999999999993,null,null,3588,9.83,null,3.8,null,null,null,null,null,null,"GB104029067655 Skitter Beck.  NEP Options RA CAP and RS for Northern Chalk Scheme.  Sc = FL minus RA 10 year peak cap.  RSA licence so if upfront permit required in AMP6.NB: New Daily quantity (col CB)calculated by dividing New Annual Quantity (Provided from AW) by 365. Environmental Outcome info (col CD) - taken from the OA final submission report by AW (CBA section), split between relevant licences. Part of final cost beneficial bundle of measures for the operational catchment.",null,null,0.217,1,1,1,"WR","£m",1]
["LNA00037","Changed",null,null,null,"WR","Humber","Lincolnshire and Northamptonshire","Anglian Water Services Ltd","7AW101744","BARROW BORES 1 - 7","Grimsby Ancholme Louth Chalk Unit","GB40401G401500","Groundwater","Grimsby Ancholme Louth Chalk Unit",null,null,null,"WFDGW_IMP_GWR",null,"WFD_IMP_WRFlow",null,"WFDGW_ND_GWR",null,"Sustainability Change","2024-12-22","Amber","4/29/09/*G/0042",506013,420280,null,null,null,"GW Category 4",null,null,null,null,null,null,null,null,null,null,null,null,null,null,null,null,null,null,null,null,null,null,null,null,null,null,null,null,null,null,null,null,null,null,"PRJ-AN45","Grimsby Ancholme Louth Chalk Unit","GB40401G401500",1,"Central Lincolnshire",null,null,7467,22.73,"Yes",1562,6.5500000000000007,null,null,5905,16.18,null,0.57999999999999996,null,null,null,null,null,null,"GB104029067605 Barrow Beck.   NEP Options RA CAP and RS for Northern Chalk Scheme. Sc = FL minus RA 10 year peak cap.  RSA licence so upfront permit required in AMP6. NB: New Daily quantity (col CB)calculated by dividing New Annual Quantity (Provided from AW) by 365. Environmental Outcome info (col CD) - taken from the OA final submission report by AW (CBA section), split between relevant licences. Part of final cost beneficial bundle of measures for the operational catchment",null,null,0.217,1,1,1,"WR","£m",1]
["LNA00038","Changed",null,null,null,"WR","Humber","Lincolnshire and Northamptonshire","Anglian Water Services Ltd","7AW101744","BARTON - BORES 1 -3","Grimsby Ancholme Louth Chalk Unit","GB40401G401500","Groundwater","Grimsby Ancholme Louth Chalk Unit",null,null,null,"WFDGW_IMP_GWR",null,"WFD_IMP_WRFlow",null,"WFDGW_ND_GWR",null,"Sustainability Change","2024-12-22","Amber","4/29/09/*G/0043",503810,421090,null,null,null,"GW Category 4",null,null,null,null,null,null,null,null,null,null,null,null,null,null,null,null,null,null,null,null,null,null,null,null,null,null,null,null,null,null,null,null,null,null,"PRJ-AN45","Grimsby Ancholme Louth Chalk Unit","GB40401G401500",1,"Central Lincolnshire",null,null,1377.4,4,"Yes",584.4,1.83,null,null,793,2.17,null,0.57999999999999996,null,null,null,null,null,null,"GB104029067605 Barrow Beck.   NEP Options RA CAP and RS for Northern Chalk Scheme. Sc = FL minus RA 10 year peak cap.  RSA licence so upfront permit required in AMP6.NB: New Daily quantity (col CB)calculated by dividing New Annual Quantity (Provided from AW) by 365. Environmental Outcome info (col CD) - taken from the OA final submission report by AW (CBA section), split between relevant licences.. Part of final cost beneficial bundle of measures for the operational catchment.",null,null,0.217,1,1,1,"WR","£m",1]
["LNA00039","Changed",null,null,null,"WR","Humber","Lincolnshire and Northamptonshire","Anglian Water Services Ltd","7AW101744","ULCEBY - BORES 1 - 3","Grimsby Ancholme Louth Chalk Unit","GB40401G401500","Groundwater","Grimsby Ancholme Louth Chalk Unit",null,null,null,"WFDGW_IMP_GWR",null,"WFD_IMP_WRFlow",null,"WFDGW_ND_GWR",null,"Sustainability Change","2024-12-22","Amber","4/29/09/*G/0117",510530,412740,null,null,null,"GW Category 4",null,null,null,null,null,null,null,null,null,null,null,null,null,null,null,null,null,null,null,null,null,null,null,null,null,null,null,null,null,null,null,null,null,null,"PRJ-AN45","Grimsby Ancholme Louth Chalk Unit","GB40401G401500",1,"Central Lincolnshire",null,null,3900,18.184999999999999,"Yes",688,9.3349999999999991,null,null,3232,8.85,null,3.8,null,null,null,null,null,null,"GB104029067655 Skitter Beck.  NEP Options RA CAP and RS for Northern Chalk Scheme.  Sc = FL minus RA 10 year peak cap.  RSA licence so  upfront permit required in AMP6. New Daily quantity (col CB)calculated by dividing New Annual Quantity (Provided from AW) by 365. Environmental Outcome info (col CD) - taken from the OA final submission report by AW (CBA section), split between relevant licences. Part of final cost beneficial bundle of measures for the operational catchment",null,null,0.217,1,1,1,"WR","£m",1]
["LNA00040","Changed",null,null,null,"WR","Humber","Lincolnshire and Northamptonshire","Anglian Water Services Ltd","7AW101744","GOXHILL","Grimsby Ancholme Louth Chalk Unit","GB40401G401500","Groundwater","Grimsby Ancholme Louth Chalk Unit",null,null,null,"WFDGW_IMP_GWR",null,"WFD_IMP_WRFlow",null,"WFDGW_ND_GWR",null,"Sustainability Change","2024-12-22","Amber","4/29/09/*G/0118",509300,419340,null,null,null,"GW Category 4",null,null,null,null,null,null,null,null,null,null,null,null,null,null,null,null,null,null,null,null,null,null,null,null,null,null,null,null,null,null,null,null,null,null,"PRJ-AN45","Grimsby Ancholme Louth Chalk Unit","GB40401G401500",1,"Central Lincolnshire",null,null,1700,9.0920000000000005,"Yes",251,5.4220000000000006,null,null,1449,3.67,null,0.57999999999999996,null,null,null,null,null,null,"GB104029067605 Barrow Beck.   NEP Options RA CAP and RS for Northern Chalk Scheme. Sc = FL minus RA 10 year peak cap.  RSA licence so if upfront permit required in AMP6.NB: New Daily quantity (col CB)calculated by dividing New Annual Quantity (Provided from AW) by 365. Environmental Outcome info (col CD) - taken from the OA final submission report by AW (CBA section), split between relevant licences.. Part of final cost beneficial bundle of measures for the operational catchment",null,null,0.217,1,1,1,"WR","£m",1]
["LNA00029","Changed",null,null,null,"WR","Anglian","Lincolnshire and Northamptonshire","Anglian Water Services Ltd","7AW101750","WELTON BORES 6 - 10","Barlings Eau","GB105030062290","River","Witham Lower",null,null,null,"WFD_IMP_WRFlow",null,"WFDGW_IMP_GWR",null,"WFD_ND_WRFlow",null,"Sustainability Change","2024-12-22","Amber","4/30/07/*G/0025",501520,381470,null,null,null,"GW Category 2",null,null,null,null,null,null,null,null,null,null,null,null,null,null,null,null,null,null,null,null,null,null,null,null,null,null,null,null,null,null,null,null,null,null,"PRJ-AN83","Witham Limestone Unit A","GB40501G444800","CAT2","Central Lincolnshire",null,null,2074.11,6.8,"Yes",613.11,2.8,null,null,1461,4,null,4.2,null,null,null,null,null,null,"GB105030062320 Faldingworth beck (ND); GB205030062426 Lower Witham; GB105030062210 Nettleham Beck. RA cap and river support from NEP options appraisal for Barlings Eau Scheme. SC -  difference between FL and RA Peak 10 years. NB: New Daily quantity (col CB)calculated by dividing New Annual Quantity (Provided from AW) by 365. Environmental Outcome info (col CD) - taken from the OA final submission report by AW (CBA section), split between licences in the scheme. Part of final cost beneficial bundle of measures for the operational catchment",null,null,0.47,1,1,1,"WR","£m",1]
["LNA00032","Changed",null,null,null,"WR","Anglian","Lincolnshire and Northamptonshire","Anglian Water Services Ltd","7AW101750","NEW BOREHOLE - SPRIDLINGTON 11","Barlings Eau","GB105030062290","River","Witham Lower",null,null,null,"WFD_IMP_WRFlow",null,"WFDGW_IMP_GWR",null,"WFD_ND_WRFlow",null,"Sustainability Change","2024-12-22","Amber","4/30/07/*G/0025",501520,381470,null,null,null,"GW Category 2",null,null,null,null,null,null,null,null,null,null,null,null,null,null,null,null,null,null,null,null,null,null,null,null,null,null,null,null,null,null,null,null,null,null,"PRJ-AN90","Witham Limestone Unit A","GB40501G444800","CAT2","Central Lincolnshire",null,null,2074.11,6.8,"Yes",1805.11,6.06,null,null,269,0.74,null,4.2,null,null,null,null,null,null,"GB 104029061890 Black Dyke (trib of Ancholme); GB 105030062320 Faldingworth Beck (ND).GW driver Serious Damage. Currently in Witham Limestone for AMP6 - solution required in AMP7.   RA cap and river support from options appraisal for Barling Eau Scheme. SC - difference between FL and RA 10 year peak. NB: New Daily quantity (col CB)calculated by dividing New Annual Quantity (Provided from AW) by 365. Environmental Outcome info (col CD) - taken from the OA final submission report by AW (CBA section)split between licences in the scheme. Part of final cost beneficial bundle of measures for the operational catchment.",null,null,0.47,1,1,1,"WR","£m",1]
["LNA00007","Changed",null,null,null,"WR","Anglian","Lincolnshire and Northamptonshire","Anglian Water Services Ltd","7AW101752","BILLINGBOROUGH - BORES A - D","Slea","GB105030056670","River","Witham Lower",null,null,null,"WFD_IMP_WRFlow",null,"WFDGW_IMP_GWR",null,"WFD_ND_WRFlow",null,"Sustainability Change","2024-12-22","Amber","4/30/12/*G/0032",511260,333940,null,null,null,"GW Category 2",null,null,null,null,null,null,null,null,null,null,null,null,null,null,null,null,null,null,null,null,null,null,null,null,null,null,null,null,null,null,null,null,null,null,"PRJ-AN51","Witham Limestone Unit A","GB40501G444800","CAT 2","Central Lincolnshire",null,null,300,1.3089999999999999,"Yes",61,0.66,null,null,239,0.65,null,1.018,null,null,null,null,null,null,"Billingborough licence is listed for the Witham Limestone/Slea in the current NEP so this has a flow and groundwater driver and has been added to be consistent with the NEP. RA Cap and river support from NEP options appraisal for the Slea scheme. RSA licence so  upfront permit required in AMP6. NB: New Daily quantity (col CB)calculated by dividing New Annual Quantity (Provided from AW) by 365. Environmental Outcome info (col CD) - taken from the OA final submission report by AW (CBA section) split between licence in the scheme. Part of final cost beneficial bundle of measures for the operational catchment",null,null,0.86099999999999999,1,1,1,"WR","£m",1]
["LNA00007","Changed",null,null,null,"WR","Anglian","Lincolnshire and Northamptonshire","Anglian Water Services Ltd","7AW101752","PINCHBECK Jockey P.S. BOREHOLE 2","Slea","GB105030056670","River","Witham Lower",null,null,null,"WFD_IMP_WRFlow",null,"WFDGW_IMP_GWR",null,"WFD_ND_WRFlow",null,"Sustainability Change","2024-12-22","Amber","4/30/12/*G/0034",517600,326330,null,null,null,"GW Category 2",null,null,null,null,null,null,null,null,null,null,null,null,null,null,null,null,null,null,null,null,null,null,null,null,null,null,null,null,null,null,null,null,null,null,"PRJ-AN51","Witham Limestone Unit A","GB40501G444800","CAT 2","East Lincolnshire",null,null,3318.65,9.0920000000000005,"Yes",484.65,1.33,null,null,2834,7.76,null,1.018,null,null,null,null,null,null,"GB205031055525 Risegate eau; GB205031055535 Fossdyke Bridge outfall.  RA cap and river restoration from NEP options appraisal for the Slea scheme.  Difference between FL and RA 10 year peak for SC. RSA licence so  upfront permit required in AMP6. NB: New Daily quantity (col CB)calculated by dividing New Annual Quantity (Provided from AW) by 365. Environmental Outcome info (col CD) - taken from the OA final submission report by AW (CBA section) split between licence in the scheme. Part of final cost beneficial bundle of measures for the operational catchment"]
["LNA00011","Changed",null,null,null,"WR","Anglian","Lincolnshire and Northamptonshire","Anglian Water Services Ltd","7AW101752","ASLACKBY PUMPING STATION","Slea","GB105030056670","River","Witham Lower",null,null,null,"WFD_IMP_WRFlow",null,"WFDGW_IMP_GWR",null,"WFD_ND_WRFlow",null,"Sustainability Change","2024-12-22","Amber","4/30/12/*G/0218",514380,330370,null,null,null,"GW Category 2",null,null,null,null,null,null,null,null,null,null,null,null,null,null,null,null,null,null,null,null,null,null,null,null,null,null,null,null,null,null,null,null,null,null,"PRJ-AN51","Witham Limestone Unit A","GB40501G444800","CAT 2","East Lincolnshire",null,null,6000,26,"Yes",3015,17.82,null,null,2985,8.18,null,1.018,null,null,null,null,null,null,"RA Cap and river support for Slea scheme  from NEP Options appraisal work.  SC is difference between FL and RA 10 year peak cap. RSA licence so  upfront permit required in AMP6. NB: New Daily quantity (col CB)calculated by dividing New Annual Quantity (Provided from AW) by 365. Environmental Outcome info (col CD) - taken from the OA final submission report by AW (CBA section) split between licence in the scheme. Part of final cost beneficial bundle of measures for the operational catchment"]
["LNA00012","Changed",null,null,null,"WR","Anglian","Lincolnshire and Northamptonshire","Anglian Water Services Ltd","7AW101752","RIPPINGALE PUMPING STATION","Slea","GB105030056670","River","Witham Lower",null,null,null,"WFD_IMP_WRFlow",null,"WFDGW_IMP_GWR",null,"WFD_ND_WRFlow",null,"Sustainability Change","2024-12-22","Amber","4/30/12/*G/0218",514380,330370,null,null,null,"GW Category 2",null,null,null,null,null,null,null,null,null,null,null,null,null,null,null,null,null,null,null,null,null,null,null,null,null,null,null,null,null,null,null,null,null,null,"PRJ-AN51","Witham Limestone Unit A","GB40501G444800","CAT 2","East Lincolnshire",null,null,6000,26,"Yes",3350,18.739999999999998,null,null,2650,7.26,null,1.018,null,null,null,null,null,null,"RA Cap and river support for Slea scheme from NEP Options appraisal work.  SC is difference between FL and RA 10 year peak cap. RSA licence so  upfront permit required in AMP6. NB: New Daily quantity (col CB)calculated by dividing New Annual Quantity (Provided from AW) by 365. Environmental Outcome info (col CD) - taken from the OA final submission report by AW (CBA section)  split between licence in the scheme. Part of final cost beneficial bundle of measures for the operational catchment"]
["LNA00013","Changed",null,null,null,"WR","Anglian","Lincolnshire and Northamptonshire","Anglian Water Services Ltd","7AW101752","SWATON","Slea","GB105030056670","River","Witham Lower",null,null,null,"WFD_IMP_WRFlow",null,"WFDGW_IMP_GWR",null,"WFD_ND_WRFlow",null,"Sustainability Change","2024-12-22","Amber","4/30/12/*G/0303",513330,338600,null,null,null,"GW Category 2",null,null,null,null,null,null,null,null,null,null,null,null,null,null,null,null,null,null,null,null,null,null,null,null,null,null,null,null,null,null,null,null,null,null,"PRJ-AN51","Witham Limestone Unit A","GB40501G444800","CAT 2","Central Lincolnshire",null,null,912.5,6,"Yes",62.5,3.67,null,null,850,2.33,null,1.018,null,null,null,null,null,null,"RA Cap and river support for Slea scheme from NEP Options appraisal work.  SC is difference between FL and RA 10 year peak cap. NB: New Daily quantity (col CB)calculated by dividing New Annual Quantity (Provided from AW) by 365. Environmental Outcome info (col CD) - taken from the OA final submission report by AW (CBA section)  split between licence in the scheme. Part of final cost beneficial bundle of measures for the operational catchment"]
["LNA00020","Changed",null,null,null,"WR","Anglian","Lincolnshire and Northamptonshire","Anglian Water Services Ltd","7AW101752","DROVE LANE AND CLAY HILL","Slea","GB105030056670","River","Witham Lower",null,null,null,"WFD_IMP_WRFlow",null,"WFDGW_IMP_GWR",null,"WFD_ND_WRFlow",null,"Sustainability Change","2024-12-22","Amber","4/30/11/*G/0037",505530,345560,null,null,null,"GW Category 2",null,null,null,null,null,null,null,null,null,null,null,null,null,null,null,null,null,null,null,null,null,null,null,null,null,null,null,null,null,null,null,null,null,null,"PRJ-AN51","Witham Limestone Unit A","GB40501G444800","CAT2","Central Lincolnshire",null,null,4159.68,13.6,"Yes",3109.68,10.72,null,null,1050,2.88,null,1.018,null,null,null,null,null,null,"Options - RA Cap and River support for the Slea scheme.  SC = FL - RA 10 year peak CAP. RSA licence so upfront permit will take place in AMP6.  NB: New Daily quantity (col CB)calculated by dividing New Annual Quantity (Provided from AW) by 365. Environmental Outcome info (col CD) - taken from the OA final submission report by AW (CBA section)  split between licence in the scheme. Part of final cost beneficial bundle of measures for the operational catchment"]
["LNA00021","Changed",null,null,null,"WR","Anglian","Lincolnshire and Northamptonshire","Anglian Water Services Ltd","7AW101752","ASWARBY","Slea","GB105030056670","River","Witham Lower",null,null,null,"WFD_IMP_WRFlow",null,"WFDGW_IMP_GWR",null,"WFD_ND_WRFlow",null,"Sustainability Change","2024-12-22","Amber","4/30/12/*G/0205",506700,339150,null,null,null,"GW Category 2",null,null,null,null,null,null,null,null,null,null,null,null,null,null,null,null,null,null,null,null,null,null,null,null,null,null,null,null,null,null,null,null,null,null,"PRJ-AN51","Witham Limestone Unit A","GB40501G444800","CAT2","Central Lincolnshire",null,null,1660,9,"Yes",307,5.29,null,null,1353,3.71,null,1.018,null,null,null,null,null,null,"Options - RA Cap and River Support.  SC = FL - RA 10 year peak CAP. RSA licence so any upfront permit will take place in AMP6. NB: New Daily quantity (col CB)calculated by dividing New Annual Quantity (Provided from AW) by 365. Environmental Outcome info (col CD) - taken from the OA final submission report by AW (CBA section)  split between licence in the scheme. Part of final cost beneficial bundle of measures for the operational catchment"]
["LNA00024","Changed",null,null,null,"WR","Anglian","Lincolnshire and Northamptonshire","Anglian Water Services Ltd","7AW101752","KIRKBY LA THORPE","Slea","GB105030056670","River","Witham Lower",null,null,null,"WFD_IMP_WRFlow",null,"WFDGW_IMP_GWR",null,"WFD_ND_WRFlow",null,"Sustainability Change","2024-12-22","Amber","4/30/12/*G/0290",509490,345640,null,null,null,"GW Category 2",null,null,null,null,null,null,null,null,null,null,null,null,null,null,null,null,null,null,null,null,null,null,null,null,null,null,null,null,null,null,null,null,null,null,"PRJ-AN90","Witham Limestone Unit A","GB40501G444800","CAT2","Central Lincolnshire",null,null,2600,10,"Yes",923,5.41,null,null,1677,4.59,null,1.018,null,null,null,null,null,null,"NEP Options RA CAP and River support for the Slea scheme.  SC is FL minus RA 10 year peak CAP. NB: New Daily quantity (col CB)calculated by dividing New Annual Quantity (Provided from AW) by 365. Environmental Outcome info (col CD) - taken from the OA final submission report by AW (CBA section)  split between licence in the scheme. Part of final cost beneficial bundle of measures for the operational catchment"]
["LNA00042","Changed",null,null,null,"WR","Anglian","Lincolnshire and Northamptonshire","Anglian Water Services Ltd","7AW101752","West Pinchbeck","Slea","GB105030056670","River","Witham Lower",null,null,null,"WFD_IMP_WRFlow",null,"WFDGW_IMP_GWR",null,"WFD_ND_WRFlow",null,"Sustainability Change","2024-12-22","Amber","4/30/12/*G/0301",516490,327740,null,null,null,"GW Category 2",null,null,null,null,null,null,null,null,null,null,null,null,null,"",null,null,null,null,null,null,null,null,null,null,null,null,null,null,null,null,null,null,null,null,"PRJ-AN90","Witham Limestone Unit A","GB40501G444800",4,"East Lincolnshire",null,null,1460,6,"yes",653,3.79,null,null,807,2.21,null,1.018,null,null,null,null,null,null,"GB105030051555 Pointon Lode.  NEP Options RA Cap and River Support for the Slea Scheme. Licence in Witham Limestone NEP for AMP6.  SC = FL minus RA 10 year peak cap. NB: New Daily quantity (col CB)calculated by dividing New Annual Quantity (Provided from AW) by 365. Environmental Outcome info (col CD) - taken from the OA final submission report by AW (CBA section) . Part of final cost beneficial bundle of measures for the operational catchment"]
["LNA00043","Changed",null,null,null,"WR","Anglian","Lincolnshire and Northamptonshire","Anglian Water Services Ltd","7AW101752","Haconby","Slea","GB105030056670","River","Witham Lower",null,null,null,"WFD_IMP_WRFlow",null,"WFDGW_IMP_GWR",null,"WFD_ND_WRFlow",null,"Sustainability Change","2024-12-22","Amber","4/30/12/*G/0302",514410,325650,null,null,null,"GW Category 2",null,null,null,null,null,null,null,null,null,null,null,null,null,"",null,null,null,null,null,null,null,null,null,null,null,null,null,null,null,null,null,null,null,null,"PRJ-AN90","Witham Limestone Unit A","GB40501G444800",4,"East Lincolnshire",null,null,3000,10,"yes",781,3.92,null,null,2219,6.08,null,1.018,null,null,null,null,null,null,"GB105030056620 South Forty Foot Drain.  NEP Options RA CAP and River Support for the Slea Scheme. Licence in Witham Limestone NEP for AMP6. SC = FL minus RA 10 year peak cap. NB: New Daily quantity (col CB)calculated by dividing New Annual Quantity (Provided from AW) by 365. Environmental Outcome info (col CD) - taken from the OA final submission report by AW (CBA section)  split between licence in the scheme. Part of final cost beneficial bundle of measures for the operational catchment"]
["LNA00014","Changed",null,null,null,"WR","Anglian","Lincolnshire and Northamptonshire","Anglian Water Services Ltd","7AW101756","WILSTHORPE","East Glen River","GB105031055480","River","Glens",null,null,null,"WFD_IMP_WRFlow",null,"WFDGW_IMP_GWR",null,"WFD_ND_WRFlow",null,"Sustainability Change","2024-12-22","Amber","5/31/12/*G/0005",508050,314840,null,null,null,"GW Category 2",null,null,null,null,null,null,null,null,null,null,null,null,null,null,null,null,null,null,null,null,null,null,null,null,null,null,null,null,null,null,null,null,null,null,"PRJ-AN79","Witham Limestone Unit A",null,"CAT 2","East Lincolnshire",null,null,8000,32,"Yes",663,1.81,null,null,7337,20.100000000000001,null,4,null,null,null,null,null,null,"RA Cap, river support and restoration from NEP options appraisal for the Glen Scheme. NB: New Daily quantity (col CB)calculated by dividing New Annual Quantity (Provided from AW) by 365. Environmental Outcome info (col CD) - taken from the OA final submission report by AW (CBA section), value is the same for LM and SC as advised by national (has not been split). Part of final cost beneficial bundle of measures for the operational catchment.",null,null,0.41399999999999998,1,1,1,"WR","£m",1]
["LNA00016","Changed",null,null,null,"WR","Anglian","Lincolnshire and Northamptonshire","Anglian Water Services Ltd","7AW101756","BOURNE","Glen","GB105031050720","River","Glens",null,null,null,"WFD_IMP_WRFlow",null,"WFDGW_IMP_GWR",null,"WFD_ND_WRFlow",null,"Sustainability Change","2024-12-22","Amber","5/31/14/*G/0079",510090,320150,null,null,null,"GW Category 2",null,null,null,null,null,null,null,null,null,null,null,null,null,null,null,null,null,null,null,null,null,null,null,null,null,null,null,null,null,null,null,null,null,null,"PRJ-AN79","Witham Limestone Unit A",null,"CAT 2","East Lincolnshire",null,null,8030,25,"Yes",3102,8.5,null,null,4928,13.5,null,1.018,null,null,null,null,null,null,"Slea GB105030056670 - Options appraisal for Slea scheme is RA Cap and RS. NB: no SC for West Glen, just river restoration was preferred option. SC is FL - RA 10 year peak cap. RSA licence for SLEA so upfront permit will take place in AMP6. EO figure from AW's CBA OA report for the Slea, split between licence in the scheme. Part of final cost beneficial bundle of measures for the operational catchment "]
["LNA00099",null,null,null,null,"WR","Anglian","Lincolnshire and Northamptonshire","Anglian Water Services Ltd","7AW101757","WILSTHORPE","East Glen River","GB105031055480","River","Glens",null,null,null,"WFD_IMP_WRFlow",null,"WFDGW_IMP_GWR",null,"WFD_ND_WRFlow",null,"Land Management/ Habitat Restoration/ Physical Improvement","2024-12-22","Amber","5/31/12/*G/0005",508050,314840,null,null,null,"GW Category 2",null,null,null,null,null,null,null,null,null,null,null,null,null,null,null,null,null,null,null,null,null,null,null,null,null,null,null,null,null,null,null,null,null,null,"PRJ-AN79","Witham Limestone Unit A",null,"CAT 2","East Lincolnshire",null,null,8000,32,"Yes",null,null,null,null,null,null,null,4,null,null,null,null,null,null,"RA Cap, river support and restoration from NEP options appraisal for the Glen Scheme. NB: New Daily quantity (col CB)calculated by dividing New Annual Quantity (Provided from AW) by 365. Environmental Outcome info (col CD) - taken from the OA final submission report by AW (CBA section), value is the same for LM and SC as advised by national (has not been split). Part of final cost beneficial bundle of measures for the operational catchment.",null,null,0.91,1,1,1,"WR","£m",1]
["LNA00100",null,null,null,null,"WR","Anglian","Lincolnshire and Northamptonshire","Anglian Water Services Ltd","7AW101757","BOURNE","Glen","GB105031050720","River","Glens",null,null,null,"WFD_IMP_WRFlow",null,"WFDGW_IMP_GWR",null,"WFD_ND_WRFlow",null,"Land Management/ Habitat Restoration/ Physical Improvement","2024-12-22","Amber","5/31/14/*G/0079",510090,320150,null,null,null,"GW Category 2",null,null,null,null,null,null,null,null,null,null,null,null,null,null,null,null,null,null,null,null,null,null,null,null,null,null,null,null,null,null,null,null,null,null,"PRJ-AN79","Witham Limestone Unit A",null,"CAT 2","East Lincolnshire",null,null,8030,25,"Yes",null,null,null,null,null,null,null,7.6,null,null,null,null,null,null,"RA Cap, river support and restoration from NEP options appraisal for the Glen Scheme .RSA licence so  upfront permit required in AMP6.  EO figure from AW's CBA OA report for the Glens. Taken from benefit table for option 13 which is the river restoration option. Part of final cost beneficial bundle of measures for the operational catchment"]
["LNA00018","Changed",null,null,null,"WR","Anglian","Lincolnshire and Northamptonshire","Anglian Water Services Ltd","7AW101761","WANEHAM BRIDGE","Witham Limestone Unit A","GB40501G444800","Groundwater","Witham Limestone Unit A",null,null,null,"WFDGW_ND_GWR",null,"WFD_ND_WRFlow",null,null,null,"Sustainability Change","2024-12-22","Amber","4/30/09/*G/0039",506301,362500,null,null,null,"GW Category 2",null,null,null,null,null,null,null,null,null,null,null,null,null,null,null,null,null,null,null,null,null,null,null,null,null,null,null,null,null,null,null,null,null,null,"PRJ-AN90","Witham Limestone Unit A","GB40501G444800","CAT2","Central Lincolnshire",null,null,1327.45,4.3600000000000003,"Yes",400.45,1.82,null,null,927,2.54,null,4.33,null,null,null,null,null,null,"Scopwick Beck GB105030056210 Metheringham Beck; GB105030056230 Dunston Beck Option is RA Cap - SC = FL - RA 10 year peak cap. RA Cap from NEP options appraisal. NB: New Daily quantity (col CB)calculated by dividing New Annual Quantity (Provided from AW) by 365. Environmental Outcome info (col CD) - taken from the OA final submission report by AW (CBA section)split between licences in the scheme. Part of final cost beneficial bundle of measures for the operational catchment"]
["LNA00019","Changed",null,null,null,"WR","Anglian","Lincolnshire and Northamptonshire","Anglian Water Services Ltd","7AW101761","MOOR FARM","Witham Limestone Unit A","GB40501G444800","Groundwater","Witham Limestone Unit A",null,null,null,"WFDGW_ND_GWR",null,"WFD_ND_WRFlow",null,null,null,"Sustainability Change","2024-12-22","Amber","4/30/09/*G/0142",504401,370200,null,null,null,"GW Category 2",null,null,null,null,null,null,null,null,null,null,null,null,null,null,null,null,null,null,null,null,null,null,null,null,null,null,null,null,null,null,null,null,null,null,"PRJ-AN90","Witham Limestone Unit A","GB40501G444800","CAT2","Central Lincolnshire",null,null,1643,5.5,"Yes",733,2.0099999999999998,null,null,910,2.4900000000000002,null,4.33,null,null,null,null,null,null,"GB205030062426 Lower Witham; GB105030056235 Car Dyke North and Delph system; GB105030062415 Sandhill Beck.  NEP Options RA CAP.  SC = FL minus RA 10 year cap.RA Cap from NEP options appraisal. NB: New Daily quantity (col CB)calculated by dividing New Annual Quantity (Provided from AW) by 365. Environmental Outcome info (col CD) - taken from the OA final submission report by AW (CBA section)split between licences in the scheme. Part of final cost beneficial bundle of measures for the operational catchment"]
["LNA00106","Changed",null,null,null,"WR","Anglian","Lincolnshire and Northamptonshire","Anglian Water Services Ltd","7AW101761","Branston Booths","Witham Limestone Unit A","GB40501G444800","Groundwater","Witham Limestone Unit A",null,null,null,"WFDGW_ND_GWR",null,"WFD_ND_WRFlow",null,null,null,"Sustainability Change","2024-12-22","Amber","4/30/09/*G/0142",504401,370200,null,null,null,"GW Category 2",null,null,null,null,null,null,null,null,null,null,null,null,null,null,null,null,null,null,null,null,null,null,null,null,null,null,null,null,null,null,null,null,null,null,null,"Witham Limestone Unit A","GB40501G444800",2,"Central Lincolnshire",null,null,1659,5.5,"Yes",764,3.05,null,null,895,2.4500000000000002,null,4.33,null,null,null,null,null,null,"GB105030062415 Sandhill Beck.  NEP options appraisal RA Cap  SC = FL - RA 10 year peak. RA Cap from NEP options appraisal. NB: New Daily quantity (col CB)calculated by dividing New Annual Quantity (Provided from AW) by 365. Environmental Outcome info (col CD) - taken from the OA final submission report by AW (CBA section)split between licences in the scheme. Part of final cost beneficial bundle of measures for the operational catchment"]
["LNA00041",null,"Yes – alteration made",null,null,"WR","Anglian","Lincolnshire and Northamptonshire","Anglian Water Services Ltd","7AW101783","RUTLAND WATER/GWASH FLOWS","Rutland Water","GB30536479","Lake","Welland Upper",null,null,null,"WFD_IMP_WRHMWB",null,null,null,null,null,"Adaptive Management","2024-12-22","Amber","5/31/10/*S/0053",490600,308300,null,null,null,null,null,null,null,null,null,null,null,"River",null,null,null,null,null,"",null,null,null,null,null,null,null,null,null,null,null,null,null,null,null,null,null,null,null,null,"PRJ-AN80",null,"",null,"Rothamford North","X","5, 8",120000,492,"Yes",null,null,null,null,null,null,null,0.85,null,null,null,null,null,null,"Implementation of outputs from current Gwash Flows project in AMP6. Whilst the action will take place in GB105031050610 Gwash it is to implement missing mitigation measures for the impacts of Rutland Water. Part of final cost beneficial bundle of measures for the operational catchment",null,null,0.46300000000000002,1,1,1,"WR","£m",1]
["EAN00470","Changed",null,null,null,"WQ","Anglian","East Anglia","Anglian Water Services Ltd","7AW200053","Ashbrook STW","Purwell","GB105033037690","River","Ivel",null,null,null,"WFD_IMPg","Phosphorus",null,null,null,null,"Continuous Discharge","2024-12-22","Amber","AWCNF1410",520230,227590,null,null,null,null,null,null,null,null,null,null,null,null,null,null,null,null,null,null,null,null,null,null,null,null,null,null,null,null,null,null,3837,"1",0.7,"No change required",630,null,null,null,null,null,null,null,null,null,null,null,null,null,null,null,null,null,null,null,null,4.0999999999999996,null,null,null,null,null,null,"Measure to improve from Good (Cycle 1 target) to Good status (Cycle 2 target)\nEnvironmental Outcome measured:  River Purwell, from point of mixing to confluence with River Hiz ",null,null,1.98,1,1,1,"WWN","£m",1]
["EAN00471",null,null,null,null,"WQ","Anglian","East Anglia","Anglian Water Services Ltd","7AW200054","Ashton STW","Tove (DS Greens Norton)","GB105033038180","River","Great Ouse Upper",null,null,null,"WFD_IMPg","Phosphorus",null,null,null,null,"Continuous Discharge","2024-12-22","Amber","AW1NF1362",476794,248822,null,null,null,null,null,null,null,null,null,null,null,null,null,null,null,null,null,null,null,null,null,null,null,null,null,null,null,null,null,null,4621,null,0.3,"Iron\n4000 ug/l (95%ile)\n8000 ug/l (UT)",1600,null,null,null,null,null,null,null,null,null,null,null,null,null,null,null,null,null,null,null,null,0.75,null,null,null,null,null,null,"Measure to improve from Poor to Good phosphate status\nEnvironmental Outcome measured:  Tributary, from point of mixing to River Tove",null,null,3.7050000000000001,1,1,1,"WWN","£m",1]
["EAN00474","Changed",null,null,null,"WQ","Anglian","East Anglia","Anglian Water Services Ltd","7AW200057","Bassingbourn STW","Mill River","GB105033038030","River","Cam Rhee and Granta",null,null,null,"WFD_IMPg","Phosphorus",null,null,null,null,"Continuous Discharge","2024-12-22","Amber","ASCNF1010",533060,245190,null,null,null,null,null,null,null,null,null,null,null,null,null,null,null,null,null,null,null,null,null,null,null,null,null,null,null,null,null,null,4742,null,0.5,"Iron\n4000 ug/l (95%ile)\n8000 ug/l (UT)",1230,null,null,null,null,null,null,null,null,null,null,null,null,null,null,null,null,null,null,null,null,7.9,null,null,null,null,null,null,"Measure to improve from Poor to Good phosphate status\nEnvironmental Outcome measured:  Mill River, from point of mixing to confluence with River Rhee",null,null,1.895,1,1,1,"WWN","£m",1]
["EAN00475",null,null,null,null,"WQ","Anglian","East Anglia","Anglian Water Services Ltd","7AW200058","Beachampton STW","Beachampton Brook","GB105033037850","River","Great Ouse Upper",null,null,null,"WFD_IMPg","Phosphorus",null,null,null,null,"Continuous Discharge","2024-12-22","Amber","AWCNF10293",477360,236670,null,null,null,null,null,null,null,null,null,null,null,null,null,null,null,null,null,null,null,null,null,null,null,null,null,null,null,null,null,null,114,null,2.5,"Iron\n4000 ug/l (95%ile)\n8000 ug/l (UT)",30,null,null,null,null,null,null,null,null,null,null,null,null,null,null,null,null,null,null,null,null,1,null,null,null,null,null,null,"Measure to improve from Poor to Good phosphate status\nEnvironmental Outcome measured:  Beachampton Brook from point of mixing to confluence with River Great Ouse",null,null,1.133,1,1,1,"WWN","£m",1]
["EAN00478",null,null,null,null,"WQ","Anglian","East Anglia","Anglian Water Services Ltd","7AW200061","Blakesley STW","Blakesley Brook","GB105033038280","River","Great Ouse Upper",null,null,null,"WFD_IMPg","Phosphorus",null,null,null,null,"Continuous Discharge","2024-12-22","Amber","AW1NF1056",462890,249780,null,null,null,null,null,null,null,null,null,null,null,null,null,null,null,null,null,null,null,null,null,null,null,null,null,null,null,null,null,null,1219,null,1,"Iron\n4000 ug/l (95%ile)\n8000 ug/l (UT)",200,null,null,null,null,null,null,null,null,null,null,null,null,null,null,null,null,null,null,null,null,4.5,null,null,null,null,null,null,"Measure to improve from Moderate to Good phosphate status\nEnvironmental Outcome measured:  Blakesley Brook, from point of mixing to confluence with River Tove",null,null,0.09,1,1,1,"WWN","£m",1]
["EAN00479",null,null,null,null,"WQ","Anglian","East Anglia","Anglian Water Services Ltd","7AW200062","Bottisham STW","Swaffham - Bulbeck Lode","GB105033042710","River","Cam Lower",null,null,null,"WFD_IMPg","Phosphorus",null,null,null,null,"Continuous Discharge","2024-12-22","Amber","AW1NF302",554400,261400,null,null,null,null,null,null,null,null,null,null,null,null,null,null,null,null,null,null,null,null,null,null,null,null,null,null,null,null,null,null,3735,null,1,"Iron\n4000 ug/l (95%ile)\n8000 ug/l (UT)",820,null,null,null,null,null,null,null,null,null,null,null,null,null,null,null,null,null,null,null,null,7.1,null,null,null,null,null,null,"Measure to improve from Poor to Good phosphate status\nEnvironmental Outcome measured:  Swaffham - Bulbeck Lode, from point of mixing to confluence with River Cam",null,null,0.66100000000000003,1,1,1,"WWN","£m",1]
["EAN00480",null,null,null,null,"WQ","Anglian","East Anglia","Anglian Water Services Ltd","7AW200063","Bourn STW","Bourn Brook","GB105033042690","River","Cam Lower",null,null,null,"WFD_IMPg","Phosphorus",null,null,null,null,"Continuous Discharge","2024-12-22","Amber","AW1NF1446",533710,257880,null,null,null,null,null,null,null,null,null,null,null,null,null,null,null,null,null,null,null,null,null,null,null,null,null,null,null,null,null,null,3172,null,0.5,"Iron\n4000 ug/l (95%ile)\n8000 ug/l (UT)",868,null,null,null,null,null,null,null,null,null,null,null,null,null,null,null,null,null,null,null,null,15.5,null,null,null,null,null,null,"Measure to improve from Poor to Good phosphate status\nEnvironmental Outcome measured:  Bourn Brook, from point of mixing to confluence with River Cam",null,null,0.64200000000000002,1,1,1,"WWN","£m",1]
["EAN00481",null,null,null,null,"WQ","Anglian","East Anglia","Anglian Water Services Ltd","7AW200064","Bradenham STW","Wissey - Upper","GB105033047890","River","Wissey",null,null,null,"WFD_IMPg","Phosphorus",null,null,null,null,"Continuous Discharge","2024-12-22","Amber","AW1NF176",591100,308700,null,null,null,null,null,null,null,null,null,null,null,null,null,null,null,null,null,null,null,null,null,null,null,null,null,null,null,null,null,null,525,null,1,"Iron\n4000 ug/l (95%ile)\n8000 ug/l (UT)",80,null,null,null,null,null,null,null,null,null,null,null,null,null,null,null,null,null,null,null,null,3.9,null,null,null,null,null,null,"Measure to improve from Moderate to Good phosphate status\nEnvironmental Outcome measured:  River Wissey, from point of mixing to sample point 48M45",null,null,0.222,1,1,1,"WWN","£m",1]
["EAN00483","Changed",null,null,null,"WQ","Anglian","East Anglia","Anglian Water Services Ltd","7AW200066","Burwell STW","New River","GB105033042780","River","Cam Lower",null,null,null,"WFD_IMPg","Phosphorus",null,null,null,null,"Continuous Discharge","2024-12-22","Amber","AW1NF1065",559140,268780,null,null,null,null,null,null,null,null,null,null,null,null,null,null,null,null,null,null,null,null,null,null,null,null,null,null,null,null,null,null,5817,"1",0.7,"No change required",1214,null,null,null,null,null,null,null,null,null,null,null,null,null,null,null,null,null,null,null,null,6.6,null,null,null,null,null,null,"Measure to improve from Good status (Cycle 1 target) to Good status (Cycle 2 target).\nEnvironmental Outcome measured:  Burwell Lode, from point of mixing to confluence with River Cam ",null,null,1.7929999999999999,1,1,1,"WWN","£m",1]
["EAN00484",null,null,null,null,"WQ","Anglian","East Anglia","Anglian Water Services Ltd","7AW200067","Carbrooke Church Rd STW (FTRS Scheme)","Watton Brook","GB105033047870","River","Wissey",null,null,null,"WFD_IMPg","Phosphorus",null,null,null,null,"Continuous Discharge","2024-12-22","Amber","AECNF11621",{"$error":"#N/A"},{"$error":"#N/A"},null,null,null,null,null,null,null,null,null,null,null,null,null,null,null,null,null,null,null,null,null,null,null,null,null,null,null,null,null,null,253,null,1,"Iron\n4000 ug/l (95%ile)\n8000 ug/l (UT)",70,null,null,null,null,null,null,null,null,null,null,null,null,null,null,null,null,null,null,null,null,6.7,null,null,null,null,null,null,"Environmental Outcome measured:  Alconbury Brook, from point of mixing to Alconbury WRC",null,null,1.252,1,1,1,"WWN","£m",1]
["EAN00485",null,null,null,null,"WQ","Anglian","East Anglia","Anglian Water Services Ltd","7AW200068","Castlethorpe STW","Tove (DS Greens Norton)","GB105033038180","River","Great Ouse Upper",null,null,null,"WFD_IMPg","Phosphorus",null,null,null,null,"Continuous Discharge","2024-12-22","Amber","AW1NFA31A",479500,243400,null,null,null,null,null,null,null,null,null,null,null,null,null,null,null,null,null,null,null,null,null,null,null,null,null,null,null,null,null,null,1029,null,1,"Iron\n4000 ug/l (95%ile)\n8000 ug/l (UT)",151,null,null,null,null,null,null,null,null,null,null,null,null,null,null,null,null,null,null,null,null,1.7,null,null,null,null,null,null,"Measure to improve from Poor to Good phosphate status\nEnvironmental Outcome measured:  River Tove, from point of mixing to confluence with River Great Ouse",null,null,0.09,1,1,1,"WWN","£m",1]
["EAN00486",null,null,null,null,"WQ","Anglian","East Anglia","Anglian Water Services Ltd","7AW200069","Chippenham STW","Lee Brook","GB105033042970","River","Lark",null,null,null,"WFD_IMPg","Phosphorus",null,null,null,null,"Continuous Discharge","2024-12-22","Amber","AW1NF420",566600,270100,null,null,null,null,null,null,null,null,null,null,null,null,null,null,null,null,null,null,null,null,null,null,null,null,null,null,null,null,null,null,429,null,1,"Iron\n4000 ug/l (95%ile)\n8000 ug/l (UT)",51,null,null,null,null,null,null,null,null,null,null,null,null,null,null,null,null,null,null,null,null,1.5,null,null,null,null,null,null,"Measure to improve from Poor to Good phosphate status\nEnvironmental Outcome measured:  Lee Brook, from point of mixing to confluence with Kennett-Lee Brook",null,null,0.157,1,1,1,"WWN","£m",1]
["EAN00488",null,null,null,null,"WQ","Anglian","East Anglia","Anglian Water Services Ltd","7AW200071","Coney Weston STW","Hopton Brook","GB105033043080","River","Little Ouse and Thet",null,null,null,"WFD_IMPg","Phosphorus",null,null,null,null,"Continuous Discharge","2024-12-22","Amber","AW1NF3374",597460,278160,null,null,null,null,null,null,null,null,null,null,null,null,null,null,null,null,null,null,null,null,null,null,null,null,null,null,null,null,null,null,2289,null,0.5,"Iron\n4000 ug/l (95%ile)\n8000 ug/l (UT)",458,null,null,null,null,null,null,null,null,null,null,null,null,null,null,null,null,null,null,null,null,14,null,null,null,null,null,null,"Measure to improve from Poor to Good phosphate status\nEnvironmental Outcomes measured:  \n3 km Hopton Brook, from point of mixing to Little Ouse (Poor to Good)\n11 km River Little Ouse, from Hopton Brook to sample point 42M07 (Moderate to Good)\nWill also protect conservation interest features on Weston Fen SSSI/SAC"]
["EAN00489",null,null,null,null,"WQ","Anglian","East Anglia","Anglian Water Services Ltd","7AW200072","Coton STW","Bin Brook","GB105033042680","River","Cam Lower",null,null,null,"WFD_IMPg","Phosphorus",null,null,null,null,"Continuous Discharge","2024-12-22","Amber","AW1NF316",541100,258500,null,null,null,null,null,null,null,null,null,null,null,null,null,null,null,null,null,null,null,null,null,null,null,null,null,null,null,null,null,null,1058,null,0.8,"Iron\n4000 ug/l (95%ile)\n8000 ug/l (UT)",189,null,null,null,null,null,null,null,null,null,null,null,null,null,null,null,null,null,null,null,null,5.4,null,null,null,null,null,null,"Measure to improve from Poor to Good phosphate status\nEnvironmental Outcome measured:  Bin Brook, from point of mixing to confluence with River Cam",null,null,1.18,1,1,1,"WWN","£m",1]
["EAN00490",null,null,null,null,"WQ","Anglian","East Anglia","Anglian Water Services Ltd","7AW200073","Cublington (Wing) STW","Ledburn Brook","GB105033030540","River","Ouzel and Milton Keynes",null,null,null,"WFD_IMPg","Phosphorus",null,null,null,null,"Continuous Discharge","2024-12-22","Amber","AW1NF700",485651,221883,null,null,null,null,null,null,null,null,null,null,null,null,null,null,null,null,null,null,null,null,null,null,null,null,null,null,null,null,null,null,2786,null,0.4,"Iron\n4000 ug/l (95%ile)\n8000 ug/l (UT)",680,null,null,null,null,null,null,null,null,null,null,null,null,null,null,null,null,null,null,null,null,8.4,null,null,null,null,null,null,"Measure to improve from Poor to Good phosphate status\nEnvironmental Outcome measured:  Ledburn Brook, from point of mixing to sample point 06M14",null,null,2.5190000000000001,1,1,1,"WWN","£m",1]
["EAN00491","Changed",null,null,null,"WQ","Anglian","East Anglia","Anglian Water Services Ltd","7AW200074","Doddington STW","Middle Level","GB205033000050","River","Middle Level",null,null,null,"WFD_IMPg","Phosphorus",null,null,null,null,"Continuous Discharge","2024-12-22","Amber","AWCNF11342",540060,291850,null,null,null,null,null,null,null,null,null,null,null,null,null,null,null,null,null,null,null,null,null,null,null,null,null,null,null,null,null,null,3817,null,0.6,"Iron\n4000 ug/l (95%ile)\n8000 ug/l (UT)",640,null,null,null,null,null,null,null,null,null,null,null,null,null,null,null,null,null,null,null,null,5.4,null,null,null,null,null,null,"Measure to improve from Poor to Good phosphate status\nEnvironmental Outcome measured:  low-level carrier drains, from point of mixing to the Old Course River Nene",null,null,0.59499999999999997,1,1,1,"WWN","£m",1]
["EAN00494","Changed",null,null,null,"WQ","Anglian","East Anglia","Anglian Water Services Ltd","7AW200077","Elmdon STW","Cam","GB105033042750","River","Cam Lower",null,null,null,"WFD_IMPg","Phosphorus",null,null,null,null,"Continuous Discharge","2024-12-22","Amber","AW1NF653",547040,240290,null,null,null,null,null,null,null,null,null,null,null,null,null,null,null,null,null,null,null,null,null,null,null,null,null,null,null,null,null,null,863,null,1,"Iron\n4000 ug/l (95%ile)\n8000 ug/l (UT)",268,null,null,null,null,null,null,null,null,null,null,null,null,null,null,null,null,null,null,null,null,5.0999999999999996,null,null,null,null,null,null,"Measure to improve from Moderate to Good phosphate status\nEnvironmental Outcome measured:  Tributary of Cam, from point of mixing to confluence with River Cam",null,null,0.22500000000000001,1,1,1,"WWN","£m",1]
["EAN00495",null,null,null,null,"WQ","Anglian","East Anglia","Anglian Water Services Ltd","7AW200078","Everton STW","Stone Brook","GB105033038190","River","Great Ouse Lower",null,null,null,"WFD_IMPg","Phosphorus",null,null,null,null,"Continuous Discharge","2024-12-22","Amber","AWCNF1068",517860,252550,null,null,null,null,null,null,null,null,null,null,null,null,null,null,null,null,null,null,null,null,null,null,null,null,null,null,null,null,null,null,431,null,1,"Iron\n4000 ug/l (95%ile)\n8000 ug/l (UT)",110,null,null,null,null,null,null,null,null,null,null,null,null,null,null,null,null,null,null,null,null,3.5,null,null,null,null,null,null,"Measure to improve from Moderate to Good phosphate status\nEnvironmental Outcome measured:  Stone Brook, from point of mixing to Tempsford STW",null,null,1.585,1,1,1,"WWN","£m",1]
["EAN00498","Changed",null,null,null,"WQ","Anglian","East Anglia","Anglian Water Services Ltd","7AW200081","Gazeley STW","Kennett-Lee Brook","GB105033042990","River","Lark",null,null,null,"WFD_IMPg","Phosphorus",null,null,null,null,"Continuous Discharge","2024-12-22","Amber","AW1NF2694",570870,263180,null,null,null,null,null,null,null,null,null,null,null,null,null,null,null,null,null,null,null,null,null,null,null,null,null,null,null,null,null,null,2291,null,0.8,"Iron\n4000 ug/l (95%ile)\n8000 ug/l (UT)",350,null,null,null,null,null,null,null,null,null,null,null,null,null,null,null,null,null,null,null,null,13,null,null,null,null,null,null,"Measure to improve from Moderate to Good phosphate status\nEnvironmental Outcome measured:  Kennett-Lee Brook, from point of mixing to confluence with Lee Brook",null,null,0.56299999999999994,1,1,1,"WWN","£m",1]
["EAN00500",null,null,null,null,"WQ","Anglian","East Anglia","Anglian Water Services Ltd","7AW200083","Great Horwood STW","Horwood Tributary","GB105033038200","River","Great Ouse Upper",null,null,null,"WFD_IMPg","Phosphorus",null,null,null,null,"Continuous Discharge","2024-12-22","Amber","AW1NF2722",477389,230656,null,null,null,null,null,null,null,null,null,null,null,null,null,null,null,null,null,null,null,null,null,null,null,null,null,null,null,null,null,null,1161,null,0.4,"Iron\n4000 ug/l (95%ile)\n8000 ug/l (UT)",548,null,null,null,null,null,null,null,null,null,null,null,null,null,null,null,null,null,null,null,null,5.5,null,null,null,null,null,null,"Measure to improve from Poor to Good phosphate status\nEnvironmental Outcome measured:  Horwood Tributary, from point of mixing to confluence with Claydon Brook",null,null,1.879,1,1,1,"WWN","£m",1]
["EAN00501",null,null,null,null,"WQ","Anglian","East Anglia","Anglian Water Services Ltd","7AW200084","Greens Norton STW","Tove (DS Greens Norton)","GB105033038180","River","Great Ouse Upper",null,null,null,"WFD_IMPg","Phosphorus",null,null,null,null,"Continuous Discharge","2024-12-22","Amber","AW1NF1004",466940,248810,null,null,null,null,null,null,null,null,null,null,null,null,null,null,null,null,null,null,null,null,null,null,null,null,null,null,null,null,null,null,1461,null,1,"Iron\n4000 ug/l (95%ile)\n8000 ug/l (UT)",370,null,null,null,null,null,null,null,null,null,null,null,null,null,null,null,null,null,null,null,null,3.7,null,null,null,null,null,null,"Measure to improve from Poor to Good phosphate status\nEnvironmental Outcome measured:  River Tove, from point of mixing to the confluence with Silverstone Brook",null,null,0.55800000000000005,1,1,1,"WWN","£m",1]
["EAN00503",null,null,null,null,"WQ","Anglian","East Anglia","Anglian Water Services Ltd","7AW200086","Hanslope STW","Tove (DS Greens Norton)","GB105033038180","River","Great Ouse Upper",null,null,null,"WFD_IMPg","Phosphorus",null,null,null,null,"Continuous Discharge","2024-12-22","Amber","AW1NF1066A",479450,247290,null,null,null,null,null,null,null,null,null,null,null,null,null,null,null,null,null,null,null,null,null,null,null,null,null,null,null,null,null,null,2309,null,1,"Iron\n4000 ug/l (95%ile)\n8000 ug/l (UT)",840,null,null,null,null,null,null,null,null,null,null,null,null,null,null,null,null,null,null,null,null,2.6,null,null,null,null,null,null,"Measure to improve from Poor to Good phosphate status\nEnvironmental Outcome measured:  Tributary, from point of mixing to River Tove"]
["EAN00505",null,null,null,null,"WQ","Anglian","East Anglia","Anglian Water Services Ltd","7AW200088","Hawstead STW","Hawstead Tributary","GB105033042930","River","Lark",null,null,null,"WFD_IMPg","Phosphorus",null,null,null,null,"Continuous Discharge","2024-12-22","Amber","ASCNF1097",584801,259709,null,null,null,null,null,null,null,null,null,null,null,null,null,null,null,null,null,null,null,null,null,null,null,null,null,null,null,null,null,null,1007,null,0.4,"Iron\n4000 ug/l (95%ile)\n8000 ug/l (UT)",220,null,null,null,null,null,null,null,null,null,null,null,null,null,null,null,null,null,null,null,null,7.3,null,null,null,null,null,null,"Measure to improve from Poor to Good phosphate status\nEnvironmental Outcome measured:  Hawstead Tributary, from point of mixing to sample point 37M05 on the River Lark",null,null,2.8460000000000001,1,1,1,"WWN","£m",1]
["EAN00507","Changed",null,null,null,"WQ","Anglian","East Anglia","Anglian Water Services Ltd","7AW200090","Ivinghoe STW","Whistle Brook","GB105033030490","River","Ouzel and Milton Keynes",null,null,null,"WFD_IMPg","Phosphorus",null,null,null,null,"Continuous Discharge","2024-12-22","Amber","AW1NF543",494200,217610,null,null,null,null,null,null,null,null,null,null,null,null,null,null,null,null,null,null,null,null,null,null,null,null,null,null,null,null,null,null,3443,null,0.3,"Iron\n4000 ug/l (95%ile)\n8000 ug/l (UT)",1066,null,null,null,null,null,null,null,null,null,null,null,null,null,null,null,null,null,null,null,null,4.0999999999999996,null,null,null,null,null,null,"Measure to improve from Poor to Good phosphate status\nEnvironmental Outcome measured:  Whistle Brook, from point of mixing to confluence with River Ouzel"]
["EAN00508","Changed",null,null,null,"WQ","Anglian","East Anglia","Anglian Water Services Ltd","7AW200091","Lidgate STW","Kennett-Lee Brook","GB105033042990","River","Lark",null,null,null,"WFD_IMPg","Phosphorus",null,null,null,null,"Continuous Discharge","2024-12-22","Amber","AW1NF348A",571200,258500,null,null,null,null,null,null,null,null,null,null,null,null,null,null,null,null,null,null,null,null,null,null,null,null,null,null,null,null,null,null,402,null,1,"Iron\n4000 ug/l (95%ile)\n8000 ug/l (UT)",85,null,null,null,null,null,null,null,null,null,null,null,null,null,null,null,null,null,null,null,null,6.1,null,null,null,null,null,null,"Measure to improve from Moderate to Good phosphate status\nEnvironmental Outcome measured:  Kennett-Lee Brook, from point of mixing to Gazeley STW",null,null,1.5820000000000001,1,1,1,"WWN","£m",1]
["EAN00509",null,null,null,null,"WQ","Anglian","East Anglia","Anglian Water Services Ltd","7AW200092","Linton STW","Granta","GB105033037810","River","Cam Rhee and Granta",null,null,null,"WFD_IMPg","Phosphorus",null,null,null,null,"Continuous Discharge","2024-12-22","Amber","ASCNF1125",554990,247860,null,null,null,null,null,null,null,null,null,null,null,null,null,null,null,null,null,null,null,null,null,null,null,null,null,null,null,null,null,null,8298,null,0.5,"Iron\n4000 ug/l (95%ile)\n8000 ug/l (UT)",1800,null,null,null,null,null,null,null,null,null,null,null,null,null,null,null,null,null,null,null,null,11.7,null,null,null,null,null,null,"Measure to improve from Poor to Good phosphate status\nEnvironmental Outcome measured:  River Granta, from point of mixing to confluence with River Cam",null,null,0.79600000000000004,1,1,1,"WWN","£m",1]
["EAN00510","Changed",null,null,null,"WQ","Anglian","East Anglia","Anglian Water Services Ltd","7AW200093","Litlington STW","Mill River","GB105033038030","River","Cam Rhee and Granta",null,null,null,"WFD_IMPg","Phosphorus",null,null,null,null,"Continuous Discharge","2024-12-22","Amber","ASCNF1126",531280,243470,null,null,null,null,null,null,null,null,null,null,null,null,null,null,null,null,null,null,null,null,null,null,null,null,null,null,null,null,null,null,934,null,0.5,"Iron\n4000 ug/l (95%ile)\n8000 ug/l (UT)",440,null,null,null,null,null,null,null,null,null,null,null,null,null,null,null,null,null,null,null,null,5.3,null,null,null,null,null,null,"Measure to improve from Poor to Good phosphate status\nEnvironmental Outcome measured:  Mill River, from point of mixing to Bassingbourn STW",null,null,1.96,1,1,1,"WWN","£m",1]
["EAN00512","Changed",null,null,null,"WQ","Anglian","East Anglia","Anglian Water Services Ltd","7AW200095","Newport STW","Cam (Newport to Audley End)","GB105033037550","River","Cam Rhee and Granta",null,null,null,"WFD_IMPg","Phosphorus",null,null,null,null,"Continuous Discharge","2024-12-22","Amber","AW1NF444",552300,234580,null,null,null,null,null,null,null,null,null,null,null,null,null,null,null,null,null,null,null,null,null,null,null,null,null,null,null,null,null,null,2765,null,1,"Iron\n4000 ug/l (95%ile)\n8000 ug/l (UT)",650,null,null,null,null,null,null,null,null,null,null,null,null,null,null,null,null,null,null,null,null,5,null,null,null,null,null,null,"Measure to improve from Poor to Good phosphate status\nEnvironmental Outcome measured:  River Cam, from point of mixing to confluence with River Slade",null,null,0.09,1,1,1,"WWN","£m",1]
["EAN00514","Changed",null,null,null,"WQ","Anglian","East Anglia","Anglian Water Services Ltd","7AW200097","Norton (Suffolk) STW","Sapiston","GB105033043280","River","Little Ouse and Thet",null,null,null,"WFD_IMPg","Phosphorus",null,null,null,null,"Continuous Discharge","2024-12-22","Amber","AW1NF169A",595100,267100,null,null,null,null,null,null,null,null,null,null,null,null,null,null,null,null,null,null,null,null,null,null,null,null,null,null,null,null,null,null,746,null,1,"Iron\n4000 ug/l (95%ile)\n8000 ug/l (UT)",154,null,null,null,null,null,null,null,null,null,null,null,null,null,null,null,null,null,null,null,null,1.3,null,null,null,null,null,null,"Measure to improve from Poor to Good phosphate status\nEnvironmental Outcome measured:  River Sapiston, from point of mixing to confluence with Stowlangtoft Stream",null,null,0.22800000000000001,1,1,1,"WWN","£m",1]
["EAN00515",null,null,null,null,"WQ","Anglian","East Anglia","Anglian Water Services Ltd","7AW200098","Odell STW","Ouse (Newport Pagnell to Roxton)","GB105033047923","River","Great Ouse Bedford",null,null,null,"WFD_IMPg","Phosphorus",null,null,null,null,"Continuous Discharge","2024-12-22","Amber","AW1NF1081",498350,257930,null,null,null,null,null,null,null,null,null,null,null,null,null,null,null,null,null,null,null,null,null,null,null,null,null,null,null,null,null,null,3688,null,0.8,"Iron\n4000 ug/l (95%ile)\n8000 ug/l (UT)",900,null,null,null,null,null,null,null,null,null,null,null,null,null,null,null,null,null,null,null,null,37.9,null,null,null,null,null,null,"Measure to improve from Poor to Good phosphate status\nEnvironmental Outcome measured:  River Great Ouse, from point of mixing to Bedford STW",null,null,1.867,1,1,1,"WWN","£m",1]
["EAN00516","Changed",null,null,null,"WQ","Anglian","East Anglia","Anglian Water Services Ltd","7AW200099","Oldhurst STW","Bury Brook","GB105033043140","River","Middle Level",null,null,null,"WFD_IMPg","Phosphorus",null,null,null,null,"Continuous Discharge","2024-12-22","Amber","AWCNF1160",529436,277772,null,null,null,null,null,null,null,null,null,null,null,null,null,null,null,null,null,null,null,null,null,null,null,null,null,null,null,null,null,null,4692,null,0.5,"Iron\n4000 ug/l (95%ile)\n8000 ug/l (UT)",1015,null,null,null,null,null,null,null,null,null,null,null,null,null,null,null,null,null,null,null,null,12.5,null,null,null,null,null,null,"Measure to improve from Bad to Good phosphate status\nEnvironmental Outcome measured:  Bury Brook, from point of mixing to Ramsey STW",null,null,1.821,1,1,1,"WWN","£m",1]
["EAN00517","Changed",null,null,null,"WQ","Anglian","East Anglia","Anglian Water Services Ltd","7AW200100","Olney STW","Ouse (Newport Pagnell to Roxton)","GB105033047923","River","Great Ouse Bedford",null,null,null,"WFD_IMPg","Phosphorus",null,null,null,null,"Continuous Discharge","2024-12-22","Amber","AW1NF1165A",489500,252300,null,null,null,null,null,null,null,null,null,null,null,null,null,null,null,null,null,null,null,null,null,null,null,null,null,null,null,null,null,null,8640,null,1,"Iron\n4000 ug/l (95%ile)\n8000 ug/l (UT)",1822,null,null,null,null,null,null,null,null,null,null,null,null,null,null,null,null,null,null,null,null,15.8,null,null,null,null,null,null,"Measure to improve from Poor to Good phosphate status\nEnvironmental Outcome measured:  River Great Ouse, from point of mixing to Odell STW",null,null,0.09,1,1,1,"WWN","£m",1]
["EAN00520",null,null,null,null,"WQ","Anglian","East Anglia","Anglian Water Services Ltd","7AW200103","Papworth Everard STW","West Brook","GB105033042730","River","Great Ouse Lower",null,null,null,"WFD_IMPg","Phosphorus",null,null,null,null,"Continuous Discharge","2024-12-22","Amber","AW1NF1003",528070,263860,null,null,null,null,null,null,null,null,null,null,null,null,null,null,null,null,null,null,null,null,null,null,null,null,null,null,null,null,null,null,4335,"2.5",0.5,"No change required",1607,null,null,null,null,null,null,null,null,null,null,null,null,null,null,null,null,null,null,null,null,8.5,null,null,null,null,null,null,"Measure to improve from Poor to Good phosphate status\nEnvironmental Outcome measured:  West Brook,from point of mixing to confluence with River Great Ouse",null,null,4.7E-2,1,1,1,"WWN","£m",1]
["EAN00522","Changed",null,null,null,"WQ","Anglian","East Anglia","Anglian Water Services Ltd","7AW200105","Quendon STW","Cam (US Newport)","GB105033037480","River","Cam Rhee and Granta",null,null,null,"WFD_IMPg","Phosphorus",null,null,null,null,"Continuous Discharge","2024-12-22","Amber","AW1NFA133",552000,231200,null,null,null,null,null,null,null,null,null,null,null,null,null,null,null,null,null,null,null,null,null,null,null,null,null,null,null,null,null,null,466,null,1,"Iron\n4000 ug/l (95%ile)\n8000 ug/l (UT)",130,null,null,null,null,null,null,null,null,null,null,null,null,null,null,null,null,null,null,null,null,4,null,null,null,null,null,null,"Measure to improve from Moderate to Good phosphate status\nEnvironmental Outcome measured:  River Cam, from point of mixing to Newport STW ",null,null,0.157,1,1,1,"WWN","£m",1]
["EAN00526","Changed",null,null,null,"WQ","Anglian","East Anglia","Anglian Water Services Ltd","7AW200109","Shudy Camps STW","Granta","GB105033037810","River","Cam Rhee and Granta",null,null,null,"WFD_IMPg","Phosphorus",null,null,null,null,"Continuous Discharge","2024-12-22","Amber","AW1NF1135",561600,243800,null,null,null,null,null,null,null,null,null,null,null,null,null,null,null,null,null,null,null,null,null,null,null,null,null,null,null,null,null,null,733,null,1,"Iron\n4000 ug/l (95%ile)\n8000 ug/l (UT)",238,null,null,null,null,null,null,null,null,null,null,null,null,null,null,null,null,null,null,null,null,9.5,null,null,null,null,null,null,"Measure to improve from Moderate to Good phosphate status\nEnvironmental Outcome measured:  River Granta, from point of mixing to Linton STW",null,null,0.22500000000000001,1,1,1,"WWN","£m",1]
["EAN00527",null,null,null,null,"WQ","Anglian","East Anglia","Anglian Water Services Ltd","7AW200110","Silverstone STW","Silverstone Brook","GB105033038250","River","Great Ouse Upper",null,null,null,"WFD_IMPg","Phosphorus",null,null,null,null,"Continuous Discharge","2024-12-22","Amber","AWCNF1191",467080,245490,null,null,null,null,null,null,null,null,null,null,null,null,null,null,null,null,null,null,null,null,null,null,null,null,null,null,null,null,null,null,2881,null,0.3,"Iron\n4000 ug/l (95%ile)\n8000 ug/l (UT)",734,null,null,null,null,null,null,null,null,null,null,null,null,null,null,null,null,null,null,null,null,7,null,null,null,null,null,null,"Measure to improve from Poor to Good phosphate status\nEnvironmental Outcome measured:  Silverstone Brook, from point of mixing to confluence with River Tove",null,null,3.0259999999999998,1,1,1,"WWN","£m",1]
["EAN00529",null,null,null,null,"WQ","Anglian","East Anglia","Anglian Water Services Ltd","7AW200112","Somersham (Cambs) STW","Counter Drain (Sutton and Mepal IDB incl. Cranbrook Drain)","GB205033000010","River","Old Bedford",null,null,null,"WFD_IMPg","Phosphorus",null,null,null,null,"Continuous Discharge","2024-12-22","Amber","AW1NF875",536270,277170,null,null,null,null,null,null,null,null,null,null,null,null,null,null,null,null,null,null,null,null,null,null,null,null,null,null,null,null,null,null,6858,"2.5",0.5,"No change required",1450,null,null,null,null,null,null,null,null,null,null,null,null,null,null,null,null,null,null,null,null,18.600000000000001,null,null,null,null,null,null,"Measure to improve from Moderate to Good phosphate status\nEnvironmental Outcome measured:  Cranbrook Drain and Counterdrain, from point of mixing to sample point 26M49",null,null,1.7569999999999999,1,1,1,"WWN","£m",1]
["EAN00533","Changed",null,null,null,"WQ","Anglian","East Anglia","Anglian Water Services Ltd","7AW200116","Stoke Goldington STW","Ravenstone Brook","GB105033038160","River","Great Ouse Bedford",null,null,null,"WFD_IMPg","Phosphorus",null,null,null,null,"Continuous Discharge","2024-12-22","Amber","AW1NF207A",484750,248780,null,null,null,null,null,null,null,null,null,null,null,null,null,null,null,null,null,null,null,null,null,null,null,null,null,null,null,null,null,null,745,null,1,"Iron\n4000 ug/l (95%ile)\n8000 ug/l (UT)",160,null,null,null,null,null,null,null,null,null,null,null,null,null,null,null,null,null,null,null,null,0.75,null,null,null,null,null,null,"Measure to improve from Poor to Good phosphate status\nEnvironmental Outcome measured:  Ravenstone Brook, from point of mixing to confluence with River Great Ouse",null,null,0.22500000000000001,1,1,1,"WWN","£m",1]
["EAN00535","Changed",null,null,null,"WQ","Anglian","East Anglia","Anglian Water Services Ltd","7AW200118","Syresham STW","Syresham Stream","GB105033037980","River","Great Ouse Upper",null,null,null,"WFD_IMPg","Phosphorus",null,null,null,null,"Continuous Discharge","2024-12-22","Amber","AW1NFA163",463300,241900,null,null,null,null,null,null,null,null,null,null,null,null,null,null,null,null,null,null,null,null,null,null,null,null,null,null,null,null,null,null,698,null,0.5,"Iron\n4000 ug/l (95%ile)\n8000 ug/l (UT)",208,null,null,null,null,null,null,null,null,null,null,null,null,null,null,null,null,null,null,null,null,3.4,null,null,null,null,null,null,"Measure to improve from Poor to Good phosphate status\nEnvironmental Outcome measured:  Syresham Stream, from point of mixing to confluence with Radstone Brook & River Great Ouse",null,null,1.718,1,1,1,"WWN","£m",1]
["EAN00536","Changed",null,null,null,"WQ","Anglian","East Anglia","Anglian Water Services Ltd","7AW200119","Thurleigh STW","Renhold Brook","GB105033043210","River","Great Ouse Bedford",null,null,null,"WFD_IMPg","Phosphorus",null,null,null,null,"Continuous Discharge","2024-12-22","Amber","AWCNF11022",505500,259090,null,null,null,null,null,null,null,null,null,null,null,null,null,null,null,null,null,null,null,null,null,null,null,null,null,null,null,null,null,null,468,null,0.5,"Iron\n4000 ug/l (95%ile)\n8000 ug/l (UT)",248,null,null,null,null,null,null,null,null,null,null,null,null,null,null,null,null,null,null,null,null,11,null,null,null,null,null,null,"Measure to improve from Moderate to Good phosphate status\nEnvironmental Outcome measured:  Renhold Brook, from point of mixing to confluence with River Great Ouse",null,null,1.915,1,1,1,"WWN","£m",1]
["EAN00537","Changed",null,null,null,"WQ","Anglian","East Anglia","Anglian Water Services Ltd","7AW200120","Thurston STW","Pakenham Stream","GB105033043300","River","Little Ouse and Thet",null,null,null,"WFD_IMPg","Phosphorus",null,null,null,null,"Continuous Discharge","2024-12-22","Amber","ASCNF1315",591700,266800,null,null,null,null,null,null,null,null,null,null,null,null,null,null,null,null,null,null,null,null,null,null,null,null,null,null,null,null,null,null,6377,null,0.3,"Iron\n4000 ug/l (95%ile)\n8000 ug/l (UT)",1500,null,null,null,null,null,null,null,null,null,null,null,null,null,null,null,null,null,null,null,null,4.5,null,null,null,null,null,null,"Measure to improve from Poor to Good phosphate status\nEnvironmental Outcome measured:  Pakenham Stream, from point of mixing to confluence with River Sapiston",null,null,4.4109999999999996,1,1,1,"WWN","£m",1]
["EAN00538","Changed",null,null,null,"WQ","Anglian","East Anglia","Anglian Water Services Ltd","7AW200121","Tiffield STW","Shutlanger Brook","GB105033038270","River","Great Ouse Upper",null,null,null,"WFD_IMPg","Phosphorus",null,null,null,null,"Continuous Discharge","2024-12-22","Amber","AWCNF1584",470100,251080,null,null,null,null,null,null,null,null,null,null,null,null,null,null,null,null,null,null,null,null,null,null,null,null,null,null,null,null,null,null,338,null,0.5,"Iron\n4000 ug/l (95%ile)\n8000 ug/l (UT)",106,null,null,null,null,null,null,null,null,null,null,null,null,null,null,null,null,null,null,null,null,7.3,null,null,null,null,null,null,"Measure to improve from Poor to Good phosphate status\nEnvironmental Outcomes measured:  \n2.4 km non-WFD river, from point of mixing to Shutlanger Brook WFd river line\n4.9 km of Shutlanger Brook to confluence with River Tove ",null,null,2.278,1,1,1,"WWN","£m",1]
["EAN00539","Changed",null,null,null,"WQ","Anglian","East Anglia","Anglian Water Services Ltd","7AW200122","Towcester STW","Tove (DS Greens Norton)","GB105033038180","River","Great Ouse Upper",null,null,null,"WFD_IMPg","Phosphorus",null,null,null,null,"Continuous Discharge","2024-12-22","Amber","AW1NF63",471748,248646,null,null,null,null,null,null,null,null,null,null,null,null,null,null,null,null,null,null,null,null,null,null,null,null,null,null,null,null,null,null,10824,"1",0.3,"No change required",2800,null,null,null,null,null,null,null,null,null,null,null,null,null,null,null,null,null,null,null,null,14.6,null,null,null,null,null,null,"Measure to improve from Poor to Good phosphate status\nEnvironmental Outcome measured:  River Tove, from point of mixing to Castlethorpe STW",null,null,4.282,1,1,1,"WWN","£m",1]
["EAN00540","Changed",null,null,null,"WQ","Anglian","East Anglia","Anglian Water Services Ltd","7AW200123","Tuddenham (Bury St Edmunds) STW","Tuddenham Stream","GB105033043010","River","Lark",null,null,null,"WFD_IMPg","Phosphorus",null,null,null,null,"Continuous Discharge","2024-12-22","Amber","ASENF1962",573970,270760,null,null,null,null,null,null,null,null,null,null,null,null,null,null,null,null,null,null,null,null,null,null,null,null,null,null,null,null,null,null,5500,"1",0.5,"No change required",1100,null,null,null,null,null,null,null,null,null,null,null,null,null,null,null,null,null,null,null,null,3.1,null,null,null,null,null,null,"Measure to improve from Poor to Good phosphate status\nEnvironmental Outcome measured:  Tuddenham Stream, from point of mixing to confluence with River Lark",null,null,1.9219999999999999,1,1,1,"WWN","£m",1]
["EAN00542","Changed",null,null,null,"WQ","Anglian","East Anglia","Anglian Water Services Ltd","7AW200125","Waresley STW","Abbotsley and Hen Brooks","GB105033043240","River","Great Ouse Lower",null,null,null,"WFD_IMPg","Phosphorus",null,null,null,null,"Continuous Discharge","2024-12-22","Amber","AW1NF2543",525920,254990,null,null,null,null,null,null,null,null,null,null,null,null,null,null,null,null,null,null,null,null,null,null,null,null,null,null,null,null,null,null,1742,null,1.5,"Iron\n4000 ug/l (95%ile)\n8000 ug/l (UT)",426,null,null,null,null,null,null,null,null,null,null,null,null,null,null,null,null,null,null,null,null,10.8,null,null,null,null,null,null,"Measure to improve from Poor to Good phosphate status\nEnvironmental Outcome measured:  Abbotsley & Hen Brooks, from point of mixing to sample point 20M15"]
["EAN00544","Changed",null,null,null,"WQ","Anglian","East Anglia","Anglian Water Services Ltd","7AW200127","Whaddon STW","Weald Brook","GB105033037870","River","Great Ouse Upper",null,null,null,"WFD_IMPg","Phosphorus",null,null,null,null,"Continuous Discharge","2024-12-22","Amber","AWCNF11058",481140,234430,null,null,null,null,null,null,null,null,null,null,null,null,null,null,null,null,null,null,null,null,null,null,null,null,null,null,null,null,null,null,731,null,0.3,"Iron\n4000 ug/l (95%ile)\n8000 ug/l (UT)",162,null,null,null,null,null,null,null,null,null,null,null,null,null,null,null,null,null,null,null,null,6.8,null,null,null,null,null,null,"Measure to improve from Poor to Good phosphate status\nEnvironmental Outcome measured:  Weald Brook, from point of mixing to sample point 03M23",null,null,3.5880000000000001,1,1,1,"WWN","£m",1]
["EAN00565","Changed",null,null,null,"WQ","Anglian","East Anglia","Anglian Water Services Ltd","7AW200143","Benhall (Saxmundham) STW","Fromus","GB105035045980","River","Suffolk Coastal",null,null,null,"WFD_IMPg","Phosphorus",null,null,null,null,"Continuous Discharge","2024-12-22","Amber","ASENF2052",638220,260560,null,null,null,null,null,null,null,null,null,null,null,null,null,null,null,null,null,null,null,null,null,null,null,null,null,null,null,null,null,null,6193,null,0.5,"Iron\n4000 ug/l (95%ile)\n8000 ug/l (UT)",1500,null,null,null,null,null,null,null,null,null,null,null,null,null,null,null,null,null,null,null,null,3.6,null,null,null,null,null,null,"Measure to improve from Poor to Good phosphate status\nCost beneficial. Environmental outcomes calculated from discharge on River Fromus to the bounday of waterbody GB105035045950 Alde - Ore (d/s confluence at sample point ADE040)  (where river channel meets the sea)",null,null,1.871,1,1,1,"WWN","£m",1]
["EAN00566","Changed",null,null,null,"WQ","Anglian","East Anglia","Anglian Water Services Ltd","7AW200144","Framlingham STW","Ore","GB105035045970","River","Suffolk Coastal",null,null,null,"WFD_IMPg","Phosphorus",null,null,null,null,"Continuous Discharge","2024-12-22","Amber","ASENF1278",628290,262120,null,null,null,null,null,null,null,null,null,null,null,null,null,null,null,null,null,null,null,null,null,null,null,null,null,null,null,null,null,null,4159,null,0.6,"Iron\n4000 ug/l (95%ile)\n8000 ug/l (UT)",1000,null,null,null,null,null,null,null,null,null,null,null,null,null,null,null,null,null,null,null,null,1.3,null,null,null,null,null,null,"Measure to improve from Moderate to Good phosphate status\nCost beneficial. Environmental Outcomes calculated from discharge until WFD smp pt ORE020. ",null,null,2.2490000000000001,1,1,1,"WWN","£m",1]
["EAN00567","Changed",null,null,null,"WQ","Anglian","East Anglia","Anglian Water Services Ltd","7AW200145","Halesworth STW","Blyth (Hevingham Hall - d/s Halesworth)","GB105035046030","River","Suffolk Coastal",null,null,null,"WFD_IMPg","Phosphorus",null,null,null,null,"Continuous Discharge","2024-12-22","Amber","ASENF1286",639250,276620,null,null,null,null,null,null,null,null,null,null,null,null,null,null,null,null,null,null,null,null,null,null,null,null,null,null,null,null,null,null,7710,null,0.5,"Iron\n4000 ug/l (95%ile)\n8000 ug/l (UT)",1700,null,null,null,null,null,null,null,null,null,null,null,null,null,null,null,null,null,null,null,null,5,null,null,null,null,null,null,"Measure to improve from Poor to Good phosphate status\nCost beneficial. approx 5km from discharge to  confulence in waterbody GB105035046290 (Blyth (d/s Halesworth) where Whenhaston watercourse (GB105035046010) joins at NGR: TM4410075361 (before the watercourses go out to Bulcamp Marshes & angel Marshes.)",null,null,0.71299999999999997,1,1,1,"WWN","£m",1]
["EAN00569","Changed",null,null,null,"WQ","Anglian","East Anglia","Anglian Water Services Ltd","7AW200147","Wenhaston STW","Wenhaston Watercourse","GB105035046010","River","Suffolk Coastal",null,null,null,"WFD_IMPg","Phosphorus",null,null,null,null,"Continuous Discharge","2024-12-22","Amber","ASENF1586",643100,274600,null,null,null,null,null,null,null,null,null,null,null,null,null,null,null,null,null,null,null,null,null,null,null,null,null,null,null,null,null,null,1901,null,0.8,"Iron\n4000 ug/l (95%ile)\n8000 ug/l (UT)",672,null,null,null,null,null,null,null,null,null,null,null,null,null,null,null,null,null,null,null,null,1.2,null,null,null,null,null,null,"Measure to improve from Poor to Good phosphate status\nCost beneficial. environmental outcomes calculated from discharge to confluence of Wenhaston watercourse (GB105035046010) witth Blyth (GB105035046290), approx at NGR: TM4410075361 (before the watercourses go out to Bulcamp Marshes & angel Marshes.)",null,null,2.78,1,1,1,"WWN","£m",1]
["EAN00573","Changed",null,null,null,"WQ","Anglian","East Anglia","Anglian Water Services Ltd","7AW200151","Rayleigh East STW (CIP2 T1)","Noblesgreen Ditch","GB105037028743","River","Crouch and Roach",null,null,null,"WFD_IMP_CHEM","Chemicals",null,null,null,null,"Continuous Discharge","2024-12-31","Amber","ASENF1172",582744,190383,null,null,null,null,null,null,null,null,null,null,null,null,null,null,null,null,null,null,null,null,null,null,null,null,"DEHP",null,null,null,null,null,20281,null,"2.9ug/ (95%)\n8.4ug/l (UT)",null,4600,null,null,null,null,null,null,null,null,null,null,null,null,null,null,null,null,null,null,null,null,4.2,null,null,null,null,null,null,null,null,null,5.4450000000000003,1,1,1,"WWN","£m",1]
["EAN00586","Changed",null,null,null,"WQ","Anglian","East Anglia","Anglian Water Services Ltd","7AW200164","Alconbury STW","Alconbury Brook","GB105033042820","River","Great Ouse Lower",null,null,null,"WFD_IMPg","Phosphorus",null,null,null,null,"Continuous Discharge","2024-12-22","Amber","AW1NF618",519260,275440,null,null,null,null,null,null,null,null,null,null,null,null,null,null,null,null,null,null,null,null,null,null,null,null,null,null,null,null,null,null,5170,"1",0.3,"No change required",620,null,null,null,null,null,null,null,null,null,null,null,null,null,null,null,null,null,null,null,null,3.2,null,null,null,null,null,null,"Measure to improve from Moderate to Good phosphate status\nEnvironmental Outcome measured:  Alconbury Brook, from point of mixing to sample point 23M04",null,null,2.9390000000000001,1,1,1,"WWN","£m",1]
["EAN00588","Changed",null,null,null,"WQ","Anglian","East Anglia","Anglian Water Services Ltd","7AW200166","Bolnhurst STW","Duloe Brook","GB105033043260","River","Great Ouse Lower",null,null,null,"WFD_IMPg","Phosphorus",null,null,null,null,"Continuous Discharge","2024-12-22","Amber","AW1NF2802",509008,260467,null,null,null,null,null,null,null,null,null,null,null,null,null,null,null,null,null,null,null,null,null,null,null,null,null,null,null,null,null,null,1184,null,0.5,"Iron\n4000 ug/l (95%ile)\n8000 ug/l (UT)",105,null,null,null,null,null,null,null,null,null,null,null,null,null,null,null,null,null,null,null,null,9.5,null,null,null,null,null,null,"Measure to improve from Moderate to Good phosphate status\nEnvironmental Outcome measured:  Duloe Brook, from point of mixing to sample point 20M13",null,null,2.3929999999999998,1,1,1,"WWN","£m",1]
["EAN00589","Changed",null,null,null,"WQ","Anglian","East Anglia","Anglian Water Services Ltd","7AW200167","Dunton STW","Millbridge and Potton Brooks","GB105033037820","River","Ivel",null,null,null,"WFD_IMPg","Phosphorus",null,null,null,null,"Continuous Discharge","2024-12-22","Amber","AWCNF1061",523300,244420,null,null,null,null,null,null,null,null,null,null,null,null,null,null,null,null,null,null,null,null,null,null,null,null,null,null,null,null,null,null,572,null,1,"Iron\n4000 ug/l (95%ile)\n8000 ug/l (UT)",140,null,null,null,null,null,null,null,null,null,null,null,null,null,null,null,null,null,null,null,null,5.9,null,null,null,null,null,null,"Measure to improve from Moderate to Good phosphate status\nEnvironmental Outcome measured:  Tributary, from point of mixing to confluence with Potton Brook",null,null,0.222,1,1,1,"WWN","£m",1]
["EAN00590","Changed",null,null,null,"WQ","Anglian","East Anglia","Anglian Water Services Ltd","7AW200168","East Harling STW","Whittle","GB105033043390","River","Little Ouse and Thet",null,null,null,"WFD_IMPg","Phosphorus",null,null,null,null,"Continuous Discharge","2024-12-22","Amber","AECNF1062",601040,288040,null,null,null,null,null,null,null,null,null,null,null,null,null,null,null,null,null,null,null,null,null,null,null,null,null,null,null,null,null,null,3255,null,1,"Iron\n4000 ug/l (95%ile)\n8000 ug/l (UT)",738,null,null,null,null,null,null,null,null,null,null,null,null,null,null,null,null,null,null,null,null,2.6,null,null,null,null,null,null,"Measure to improve from Poor to Good phosphate status\nEnvironmental Outcome measured:  River Whittle, from point of mixing to confluence with River Thet"]
["EAN00591","Changed",null,null,null,"WQ","Anglian","East Anglia","Anglian Water Services Ltd","7AW200169","Ely (New) STW","Ely Ouse (South Level)","GB205033000070","River","South Level and Cut-Off Channel",null,null,null,"WFD_IMPg","Phosphorus",null,null,null,null,"Continuous Discharge","2024-12-22","Amber","AWCNF11352",554230,278170,null,null,null,null,null,null,null,null,null,null,null,null,null,null,null,null,null,null,null,null,null,null,null,null,null,null,null,null,null,null,9988,"2",0.7,"No change required",1604,null,null,null,null,null,null,null,null,null,null,null,null,null,null,null,null,null,null,null,null,2.1,null,null,null,null,null,null,"Measure to improve from Moderate to Good phosphate status\nEnvironmental Outcome measured:  Ely Ouse, from point of mixing to Ely STW",null,null,1.1040000000000001,1,1,1,"WWN","£m",1]
["EAN00592","Changed",null,null,null,"WQ","Anglian","East Anglia","Anglian Water Services Ltd","7AW200170","Ely STW","Ely Ouse (South Level)","GB205033000070","River","South Level and Cut-Off Channel",null,null,null,"WFD_IMPg","Phosphorus",null,null,null,null,"Continuous Discharge","2024-12-22","Amber","AW1NF1176",554800,280000,null,null,null,null,null,null,null,null,null,null,null,null,null,null,null,null,null,null,null,null,null,null,null,null,null,null,null,null,null,null,13597,"2",0.8,"Iron\nCurrent permit only has UT?\nAdd 4 mg/l (LUT)",4350,null,null,null,null,null,null,null,null,null,null,null,null,null,null,null,null,null,null,null,null,25,null,null,null,null,null,null,"Measure to improve from Poor to Good phosphate status\nEnvironmental Outcome measured:  Ely Ouse, from point of mixing to Denver Complex",null,null,1.998,1,1,1,"WWN","£m",1]
["EAN00594","Changed",null,null,null,"WQ","Anglian","East Anglia","Anglian Water Services Ltd","7AW200172","Great Ellingham STW","Thet (US Swangey Fen)","GB105033047830","River","Little Ouse and Thet",null,null,null,"WFD_IMPg","Phosphorus",null,null,null,null,"Continuous Discharge","2024-12-22","Amber","AW1NF18PA",602300,297800,null,null,null,null,null,null,null,null,null,null,null,null,null,null,null,null,null,null,null,null,null,null,null,null,null,null,null,null,null,null,471,null,1.5,"Iron\n4000 ug/l (95%ile)\n8000 ug/l (UT)",194,null,null,null,null,null,null,null,null,null,null,null,null,null,null,null,null,null,null,null,null,4,null,null,null,null,null,null,"Measure to improve from Moderate to Good phosphate status\nEnvironmental Outcome measured:  Tributary, from point of mixing to confluence with River Thet",null,null,0.22500000000000001,1,1,1,"WWN","£m",1]
["EAN00595","Changed",null,null,null,"WQ","Anglian","East Anglia","Anglian Water Services Ltd","7AW200173","Great Gidding STW","Alconbury Brook","GB105033042820","River","Great Ouse Lower",null,null,null,"WFD_IMPg","Phosphorus",null,null,null,null,"Continuous Discharge","2024-12-22","Amber","AWCNF1282",512032,282370,null,null,null,null,null,null,null,null,null,null,null,null,null,null,null,null,null,null,null,null,null,null,null,null,null,null,null,null,null,null,279,"2",0.4,"No change required",80,null,null,null,null,null,null,null,null,null,null,null,null,null,null,null,null,null,null,null,null,14.5,null,null,null,null,null,null,"Measure to improve from Good status (Cycle 1 target) to Good status (Cycle 2 target).\nEnvironmental Outcome measured:  Alconbury Brook, from point of mixing to Alconbury WRC",null,null,1.478,1,1,1,"WWN","£m",1]
["EAN00597","Changed",null,null,null,"WQ","Anglian","East Anglia","Anglian Water Services Ltd","7AW200175","Helmdon STW","Helmdon Brook","GB105033038230","River","Great Ouse Upper",null,null,null,"WFD_IMPg","Phosphorus",null,null,null,null,"Continuous Discharge","2024-12-22","Amber","AWCNF10454",458430,243770,null,null,null,null,null,null,null,null,null,null,null,null,null,null,null,null,null,null,null,null,null,null,null,null,null,null,null,null,null,null,1207,null,0.5,"Iron\n4000 ug/l (95%ile)\n8000 ug/l (UT)",295,null,null,null,null,null,null,null,null,null,null,null,null,null,null,null,null,null,null,null,null,6.6,null,null,null,null,null,null,"Measure to improve from Poor to Good phosphate status\nEnvironmental Outcomes measured:  \n3.5 km Helmdon Brook (Poor to Good), from point of mixing to River Tove\n3.1 km River Tove (Moderate to Good), from Helmdon Brook to Wappenham STW",null,null,0.84899999999999998,1,1,1,"WWN","£m",1]
["EAN00598","Changed",null,null,null,"WQ","Anglian","East Anglia","Anglian Water Services Ltd","7AW200176","Marston Moretaine STW","Elstow Brook (US Shortstown)","GB105033038050","River","Great Ouse Bedford",null,null,null,"WFD_IMPg","Phosphorus",null,null,null,null,"Continuous Discharge","2024-12-22","Amber","AW1NF3013",500070,242150,null,null,null,null,null,null,null,null,null,null,null,null,null,null,null,null,null,null,null,null,null,null,null,null,null,null,null,null,null,null,9524,"2","0.5\n","No change required",2300,null,null,null,null,null,null,null,null,null,null,null,null,null,null,null,null,null,null,null,null,16.899999999999999,0.8,null,null,null,null,null,"Measure to improve from Moderate to Good phosphate status\nEnvironmental Outcome measured:  \n10.9 km Good (Cycle 1 target) to Good (Cycle 2 target) in Elstow Brook, point of mixing to confluence with Harrowden Brook\n6 km Moderate to Good in Elstow Brook, Harrowden Brook confluence to River Great Ouse \n0.8 km2 improvement within TP Moderate band (Stewartby Lake)",null,null,1.8440000000000001,1,1,1,"WWN","£m",1]
["EAN00600","Changed",null,null,null,"WQ","Anglian","East Anglia","Anglian Water Services Ltd","7AW200178","Old Buckenham STW","Buckenham Stream","GB105033043411","River","Little Ouse and Thet",null,null,null,"WFD_IMPg","Phosphorus",null,null,null,null,"Continuous Discharge","2024-12-22","Amber","AW1NF623A",606120,290450,null,null,null,null,null,null,null,null,null,null,null,null,null,null,null,null,null,null,null,null,null,null,null,null,null,null,null,null,null,null,2914,null,1,"Iron\n4000 ug/l (95%ile)\n8000 ug/l (UT)",550,null,null,null,null,null,null,null,null,null,null,null,null,null,null,null,null,null,null,null,null,10,null,null,null,null,null,null,"Measure to improve from Moderate to Good phosphate status\nEnvironmental Outcome measured:  Buckenham Stream, from point of mixing to confluence with River Thet",null,null,0.09,1,1,1,"WWN","£m",1]
["EAN00601","Changed",null,null,null,"WQ","Anglian","East Anglia","Anglian Water Services Ltd","7AW200179","Old Weston STW","Cock Brook","GB105033042810","River","Great Ouse Lower",null,null,null,"WFD_IMPg","Phosphorus",null,null,null,null,"Continuous Discharge","2024-12-22","Amber","AWCNF11994",510170,276990,null,null,null,null,null,null,null,null,null,null,null,null,null,null,null,null,null,null,null,null,null,null,null,null,null,null,null,null,null,null,168,null,1,"Iron\n4000 ug/l (95%ile)\n8000 ug/l (UT)",59,null,null,null,null,null,null,null,null,null,null,null,null,null,null,null,null,null,null,null,null,12.3,null,null,null,null,null,null,"Measure to improve from Moderate to Good phosphate status\nEnvironmental Outcome measured:  Cock Brook, from point of mixing to sample point 23M06 (Huntingdon Research Centre, non-Aws discharge)",null,null,1.254,1,1,1,"WWN","£m",1]
["EAN00604","Changed",null,null,null,"WQ","Anglian","East Anglia","Anglian Water Services Ltd","7AW200182","Thetford STW","Little Ouse River","GB105033043400","River","Little Ouse and Thet",null,null,null,"WFD_IMPg","Phosphorus",null,null,null,null,"Continuous Discharge","2024-12-22","Amber","AW1NF260",585520,283440,null,null,null,null,null,null,null,null,null,null,null,null,null,null,null,null,null,null,null,null,null,null,null,null,null,null,null,null,null,null,30491,"2",0.9,"No change required",8810,null,null,null,null,null,null,null,null,null,null,null,null,null,null,null,null,null,null,null,null,31.6,null,null,null,null,null,null,"Measure to improve from Moderate to Good phosphate status\nEnvironmental Outcome measured:  River Little Ouse, from point of mixing to sample point 46M07",null,null,0.38700000000000001,1,1,1,"WWN","£m",1]
["EAN00623","Changed",null,null,null,"WQ","Anglian","East Anglia","Anglian Water Services Ltd","7AW200201","Debenham STW","Deben (u/s Brandeston Bridge)","GB105035046200","River","Deben",null,null,null,"WFD_IMPg","Phosphorus",null,null,null,null,"Continuous Discharge","2024-12-22","Amber","ASENF1054",618070,262560,null,null,null,null,null,null,null,null,null,null,null,null,null,null,null,null,null,null,null,null,null,null,null,null,null,null,null,null,null,null,2025,null,0.5,"Iron\n4000 ug/l (95%ile)\n8000 ug/l (UT)",340,null,null,null,null,null,null,null,null,null,null,null,null,null,null,null,null,null,null,null,null,7.1,null,null,null,null,null,null,"Environmental outcomes calculated from Debenham STW to sample point DEB030 in WB GB105035046310 Deben (Brandeston Bridge - Melton), improvement from bad at sample point DEB020 to good status",null,null,0.65200000000000002,1,1,1,"WWN","£m",1]
["EAN00624","Changed",null,null,null,"WQ","Anglian","East Anglia","Anglian Water Services Ltd","7AW200202","Earl Soham STW","Earl Soham Watercourse","GB105035046210","River","Deben",null,null,null,"WFD_IMPg","Phosphorus",null,null,null,null,"Continuous Discharge","2024-12-22","Amber","AW4NF595X",623300,262800,null,null,null,null,null,null,null,null,null,null,null,null,null,null,null,null,null,null,null,null,null,null,null,null,null,null,null,null,null,null,315,null,0.9,"Iron\n4000 ug/l (95%ile)\n8000 ug/l (UT)",80,null,null,null,null,null,null,null,null,null,null,null,null,null,null,null,null,null,null,null,null,2.7,null,null,null,null,null,null,"Environmental Outcomes calculated from Earl Soham STW point of mixing to DEB030 in WB GB105035046310.Deben (Brandeston Bridge - Melton), improvement from poor to good status",null,null,1.335,1,1,1,"WWN","£m",1]
["EAN00628","Changed",null,null,null,"WQ","Anglian","East Anglia","Anglian Water Services Ltd","7AW200206","Rendlesham Park STW","Deben (Brandeston Bridge - Melton)","GB105035046310","River","Deben",null,null,null,"WFD_IMPg","Phosphorus",null,null,null,null,"Continuous Discharge","2024-12-22","Amber","ASENF19613",632360,253680,null,null,null,null,null,null,null,null,null,null,null,null,null,null,null,null,null,null,null,null,null,null,null,null,null,null,null,null,null,null,2342,null,1,"Iron\n4000 ug/l (95%ile)\n8000 ug/l (UT)",645.5,null,null,null,null,null,null,null,null,null,null,null,null,null,null,null,null,null,null,null,null,5.5,null,null,null,null,null,null,"Environmental outcomes calculated from mixing point of Rendlesham Part STW to the bottom boundary of waterbody Deben (Brandeston Bridge - Melton) GB105035046310 where it joins the coast. Improvement from Poor to Good status.",null,null,0.09,1,1,1,"WWN","£m",1]
["EAN00629","Changed",null,null,null,"WQ","Anglian","East Anglia","Anglian Water Services Ltd","7AW200207","Wickham Market STW","Deben (Brandeston Bridge - Melton)","GB105035046310","River","Deben",null,null,null,"WFD_IMPg","Phosphorus",null,null,null,null,"Continuous Discharge","2024-12-22","Amber","ASENF10537",630930,255850,null,null,null,null,null,null,null,null,null,null,null,null,null,null,null,null,null,null,null,null,null,null,null,null,null,null,null,null,null,null,2627,null,1,"Iron\n4000 ug/l (95%ile)\n8000 ug/l (UT)",580,null,null,null,null,null,null,null,null,null,null,null,null,null,null,null,null,null,null,null,null,3,null,null,null,null,null,null,"Environmental outcomes calculated from point of mixing at Wickham Market STW to u/s of Rendlesham Park STW., poor to good. ",null,null,0.63700000000000001,1,1,1,"WWN","£m",1]
["EAN00630","Changed",null,null,null,"WQ","Anglian","East Anglia","Anglian Water Services Ltd","7AW200208","Earls Colne STW","Colne (d/s Doe's Corner)","GB105037041330","River","Colne Essex",null,null,null,"WFD_IMPg","Phosphorus",null,null,null,null,"Continuous Discharge","2024-12-22","Amber","AW2NFE11569",586440,229220,null,null,null,null,null,null,null,null,null,null,null,null,null,null,null,null,null,null,null,null,null,null,null,null,null,null,null,null,null,null,4687,null,0.5,"Iron\n4000 ug/l (95%ile)\n8000 ug/l (UT)",934,null,null,null,null,null,null,null,null,null,null,null,null,null,null,null,null,null,null,null,null,8.5,0.10100000000000001,null,null,null,null,null,"Colne catchment bundle is cost beneficial. This scheme contributes to getting to good for P at Ardleigh Reservoir, and to reducing algae at the reservopir (identifed as an issue for the drinking water source).  The main pumped input to the reservoir is from the Colne. Environmental Outcomes calculated from improved from Earls Coln discharge to Eight Ash green STW (from poor  to good status at point of mixing).  Lake outcome calculated as area of Ardleigh reservoir divided by the 5 main discharges contributing to good",null,null,2.085,1,1,1,"WWN","£m",1]
["EAN00631","Changed",null,null,null,"WQ","Anglian","East Anglia","Anglian Water Services Ltd","7AW200209","Ridgewell STW","Colne (u/s Gt. Yeldham)","GB105037041290","River","Colne Essex",null,null,null,"WFD_IMPg","Phosphorus",null,null,null,null,"Continuous Discharge","2024-12-22","Amber","AW2NFE00163",575450,239530,null,null,null,null,null,null,null,null,null,null,null,null,null,null,null,null,null,null,null,null,null,null,null,null,null,null,null,null,null,null,452,null,1,"Iron\n4000 ug/l (95%ile)\n8000 ug/l (UT)",102,null,null,null,null,null,null,null,null,null,null,null,null,null,null,null,null,null,null,null,null,8.5,null,null,null,null,null,null,"Colne catchment bundle is cost beneficial Also achieves good status at d/s sample point in WB d/s CL0848 (currently poor status).Environmental outcomes calculated from ridgewell stw discharge to Sible Hedingham STW (from moderate to good status)",null,null,0.157,1,1,1,"WWN","£m",1]
["EAN00632","Changed",null,null,null,"WQ","Anglian","East Anglia","Anglian Water Services Ltd","7AW200210","Stambourne STW","Stambourne Brook","GB105037041280","River","Colne Essex",null,null,null,"WFD_IMPg","Phosphorus",null,null,null,null,"Continuous Discharge","2024-12-22","Amber","ASENF1581",572350,238740,null,null,null,null,null,null,null,null,null,null,null,null,null,null,null,null,null,null,null,null,null,null,null,null,null,null,null,null,null,null,324,null,0.5,"Iron\n4000 ug/l (95%ile)\n8000 ug/l (UT)",70,null,null,null,null,null,null,null,null,null,null,null,null,null,null,null,null,null,null,null,null,4.4000000000000004,null,null,null,null,null,null,"Colne catchment bundle is cost beneficial. This achieves good status at sample point within failing WB, but also achieves good status at d/s sample point in WB d/s CL0848 (currently poor status)  Environmental Outcomes calculated from Stambourne discharge to confluence with the main river Colne (improved from poor to good)",null,null,2.343,1,1,1,"WWN","£m",1]
["EAN00633","Changed",null,null,null,"WQ","Anglian","East Anglia","Anglian Water Services Ltd","7AW200211","West Bergholt STW","Colne (d/s Doe's Corner)","GB105037041330","River","Colne Essex",null,null,null,"WFD_IMPg","Phosphorus",null,null,null,null,"Continuous Discharge","2024-12-22","Amber","AW2NF335",595960,226570,null,null,null,null,null,null,null,null,null,null,null,null,null,null,null,null,null,null,null,null,null,null,null,null,null,null,null,null,null,null,5186,null,0.5,"Iron\n4000 ug/l (95%ile)\n8000 ug/l (UT)",1430,null,null,null,null,null,null,null,null,null,null,null,null,null,null,null,null,null,null,null,null,10.1,0.10100000000000001,null,null,null,null,null,"Colne catchment bundle is cost beneficial. This scheme contributes to getting to good for P at Ardleigh Reservoir, and to reducing algae at the reservopir (identifed as an issue for the drinking water source).  The main pumped input to the reservoir is from the Colne. Environmental outcomes calculated from west berholt discharge to point where river goes out to estuary, sample point  CL01. imrpoved from poor to good. Lake outcome calculated as area of Ardleigh reservoir divided by the 5 main dischares contributing to good",null,null,2.06,1,1,1,"WWN","£m",1]
["EAN00634","Changed",null,null,null,"WQ","Anglian","East Anglia","Anglian Water Services Ltd","7AW200212","Eight Ash Green STW","Colne (d/s Doe's Corner)","GB105037041330","River","Colne Essex",null,null,null,"WFD_IMPg","Phosphorus",null,null,null,null,"Continuous Discharge","2024-12-22","Amber","ASENF12063",593000,227150,null,null,null,null,null,null,null,null,null,null,null,null,null,null,null,null,null,null,null,null,null,null,null,null,null,null,null,null,null,null,2923,null,0.8,"Iron\n4000 ug/l (95%ile)\n8000 ug/l (UT)",650,null,null,null,null,null,null,null,null,null,null,null,null,null,null,null,null,null,null,null,null,3.74,0.10100000000000001,null,null,null,null,null,"Colne catchment bundle is cost beneficial. This scheme contributes to getting to good for P at Ardleigh Reservoir, and to reducing algae at the reservopir (identifed as an issue for the drinking water source).  The main pumped input to the reservoir is from the Colne. Environmental Outcomes calculated from discharge to West Bergholt STW. from poor to good status at point of mixing, bad to good at waterbody level. Lake outcome calculated as area of Ardleigh reservoir divided by the 5 main discharges contributing to good",null,null,1.93,1,1,1,"WWN","£m",1]
["EAN00635","Changed",null,null,null,"WQ","Anglian","East Anglia","Anglian Water Services Ltd","7AW200213","Gosfield STW","Bourne Brook","GB105037041150","River","Colne Essex",null,null,null,"WFD_IMPg","Phosphorus",null,null,null,null,"Continuous Discharge","2024-12-22","Amber","ASENF1076",578260,228980,null,null,null,null,null,null,null,null,null,null,null,null,null,null,null,null,null,null,null,null,null,null,null,null,null,null,null,null,null,null,1221,null,0.3,"Iron\n4000 ug/l (95%ile)\n8000 ug/l (UT)",290,null,null,null,null,null,null,null,null,null,null,null,null,null,null,null,null,null,null,null,null,8,null,null,null,null,null,null,"Colne catchment bundle is cost beneficial. Environmental Outcomes calculated from Gisfield STW discharge to confluence with main River colne. from poor to good status at point of mixing",null,null,2.8559999999999999,1,1,1,"WWN","£m",1]
["EAN00636","Changed",null,null,null,"WQ","Anglian","East Anglia","Anglian Water Services Ltd","7AW200214","Great Bromley STW","Tenpenny Brook","GB105037041310","River","Colne Essex",null,null,null,"WFD_IMPg","Phosphorus",null,null,null,null,"Continuous Discharge","2024-12-22","Amber","ASENF10358",608280,225870,null,null,null,null,null,null,null,null,null,null,null,null,null,null,null,null,null,null,null,null,null,null,null,null,null,null,null,null,null,null,1103,null,0.25,"Iron\n4000 ug/l (95%ile)\n8000 ug/l (UT)",365,null,null,null,null,null,null,null,null,null,null,null,null,null,null,null,null,null,null,null,null,6.7,null,null,null,null,null,null,"Scheme within Tenpenny waterbody which flows straight out to estuary so can be classed as separate from rest of Colne catchment (can be in a separate bundle). Schemes in Tenpenny are also cost beneficial . WB 'quite certain eutrophication' and 90% AWS fair share contribution and bad P status. This scheme will achieve good status in a large stretch of the WB as in the headwaters compared to Thorrington STW which is near to the bottom where the watercourse meets the estuary. Both thorrington and Gt Bromley (in Tenpenny WB) are still cost beneficial in a separate bundle as goes out to estuary. km improved from poor to good at point of mixing",null,null,2.9340000000000002,1,1,1,"WWN","£m",1]
["EAN00637",null,null,null,null,"WQ","Anglian","East Anglia","Anglian Water Services Ltd","7AW200215","Halstead (Langley) STW","Colne (d/s Doe's Corner)","GB105037041330","River","Colne Essex",null,null,null,"WFD_IMPg","Phosphorus",null,null,null,null,"Continuous Discharge","2024-12-22","Amber","AW2NF524",583600,229700,null,null,null,null,null,null,null,null,null,null,null,null,null,null,null,null,null,null,null,null,null,null,null,null,null,null,null,null,null,null,13881,2,0.3,"No change required",2900,null,null,null,null,null,null,null,null,null,null,null,null,null,null,null,null,null,null,null,null,3.3,0.10100000000000001,null,null,null,null,null,"Colne catchment bundle is cost beneficial. This scheme contributes to getting to good for P at Ardleigh Reservoir, and to reducing algae at the reservopir (identifed as an issue for the drinking water source).  The main pumped input to the reservoir is from the Colne. Environmental outcomes calculated from Halstead discharge to Earls Colne STW. from poor to good. Lake outcome calculated as area of Ardleigh reservoir divided by the 5 main discharges contributing to good"]
["EAN00638","Changed",null,null,null,"WQ","Anglian","East Anglia","Anglian Water Services Ltd","7AW200216","Sible Hedingham STW","Colne (Gt. Yeldham - Doe's Corner)","GB105037041260","River","Colne Essex",null,null,null,"WFD_IMPg","Phosphorus",null,null,null,null,"Continuous Discharge","2024-12-22","Amber","ASENF10532",579340,232970,null,null,null,null,null,null,null,null,null,null,null,null,null,null,null,null,null,null,null,null,null,null,null,null,null,null,null,null,null,null,6575,null,0.3,"Iron\n4000 ug/l (95%ile)\n8000 ug/l (UT)",1700,null,null,null,null,null,null,null,null,null,null,null,null,null,null,null,null,null,null,null,null,8,0.10100000000000001,null,null,null,null,null,"Colne catchment bundle is cost beneficial. This scheme contributes to getting to good for P at Ardleigh Reservoir, and to reducing algae at the reservopir (identifed as an issue for the drinking water source).  The main pumped input to the reservoir is from the Colne. Environment Outcomes calculated from Sible Hedingham discharge to Halstead Langley STW. from poor to good status. Lake outcome calculated as area of Ardleigh reservoir divided by the 5 main discharges contributing to good",null,null,3.8159999999999998,1,1,1,"WWN","£m",1]
["EAN00639","Changed",null,null,null,"WQ","Anglian","East Anglia","Anglian Water Services Ltd","7AW200217","Thorrington STW","Tenpenny Brook","GB105037041310","River","Colne Essex",null,null,null,"WFD_IMPg","Phosphorus",null,null,null,null,"Continuous Discharge","2024-12-22","Amber","AW2NFE02070",607960,220530,null,null,null,null,null,null,null,null,null,null,null,null,null,null,null,null,null,null,null,null,null,null,null,null,null,null,null,null,null,null,6688,null,0.25,"Iron\n4000 ug/l (95%ile)\n8000 ug/l (UT)",2400,null,null,null,null,null,null,null,null,null,null,null,null,null,null,null,null,null,null,null,null,0.9,null,null,null,null,null,null,"Scheme within Tenpenny waterbody which flows straight out to estuary so can be classed as separate from rest of Colne catchment. Schemes in Tenpenny are also cost beneficial.  WB 'quite certain eutrophication' and 90% AWS fair share contribution and bad P status. This permit is needed in combination with Gt Bromley to achieve good status in the WB, however this discharge is very near the bottom of the WB before it goes out to estuary) Both thorrington and Gt Bromley (in Tenpenny WB) are still cost beneficial in a separate bundle. Environmental outcomes calculated to see an improvement from bad to good from discharge to WFD sample point at bottom of waterbody. ",null,null,3.528,1,1,1,"WWN","£m",1]
["EAN00650","Changed",null,null,null,"WQ","Anglian","East Anglia","Anglian Water Services Ltd","7AW200228","Sisland (Loddon) STW","River Chet","GB105034051190","River","Yare",null,null,null,"WFD_IMPg","Phosphorus",null,null,null,null,"Continuous Discharge","2024-12-22","Amber","AW4NF1064X",634311,299447,null,null,null,null,null,null,null,null,null,null,null,null,null,null,null,null,null,null,null,null,null,null,null,null,null,null,null,null,null,null,8102,1,0.6,"No change required",1600,null,null,null,null,null,null,null,null,null,null,null,null,null,null,null,null,null,null,null,null,3.3,null,null,null,null,null,null,"Measure to improve from Poor to Good phosphate status\nPart of cost beneficial bundle. Environmental Outcomes calculated from sisland discharge to WFD waterbody boundary GB105034051190 point (where river meets TrAC waterbody). Improvements may extend beyond boundary into TrAC but unable to measure these.  ",null,null,1.97,1,1,1,"WWN","£m",1]
["EAN00651","Changed",null,null,null,"WQ","Anglian","East Anglia","Anglian Water Services Ltd","7AW200229","Swardeston STW","Intwood Stream","GB105034051240","River","Yare",null,null,null,"WFD_IMPg","Phosphorus",null,null,null,null,"Continuous Discharge","2024-12-22","Amber","AEENF1220",619600,302850,null,null,null,null,null,null,null,null,null,null,null,null,null,null,null,null,null,null,null,null,null,null,null,null,null,null,null,null,null,null,4912,null,0.4,"Iron\n4000 ug/l (95%ile)\n8000 ug/l (UT)",1100,null,null,null,null,null,null,null,null,null,null,null,null,null,null,null,null,null,null,null,null,3,null,null,null,null,null,null,"Measure to improve from Poor to Good phosphate status\nPart of cost beneficial bundle. Environmental outcomes calculated from swardeston discharge to confluence with main river Yare (Tiffey to wensum GB105034051281)"]
["EAN00663","Changed",null,null,null,"WQ","Anglian","East Anglia","Anglian Water Services Ltd","7AW200241","Billericay (Outwood) STW","Crouch (A129 - Wickford)","GB105037028540","River","Crouch and Roach",null,null,null,"WFD_IMPg","Phosphorus",null,null,null,null,"Continuous Discharge","2024-12-22","Amber","AW2NFE05358",569890,194200,null,null,null,null,null,null,null,null,null,null,null,null,null,null,null,null,null,null,null,null,null,null,null,null,null,null,null,null,null,null,7674,null,0.3,"Iron\n4000 ug/l (95%ile)\n8000 ug/l (UT)",1417,null,null,null,null,null,null,null,null,null,null,null,null,null,null,null,null,null,null,null,null,9.5,null,null,null,null,null,null,"confirmed as cost beneficial. Environmental Outcomes km2 improved figure from discharge until  boundary of WB GB105037028550, improvement from poor status to good."]
["EAN00685","Changed",null,null,null,"WQ","Anglian","Lincolnshire and Northamptonshire","Anglian Water Services Ltd","7AW200263","Mablethorpe STW","Woldgrift Drain","GB105029061750","River","Steeping and Eaus",null,null,null,"U_IMP2","Phosphorus",null,null,null,null,"Continuous Discharge","2025-03-31","Amber","ANNNF13149",549094,382501,null,null,null,null,null,null,null,null,null,null,null,null,null,null,null,null,null,null,null,null,null,null,null,null,null,null,null,null,null,null,22268,"-","2 (AA)","Total Iron= 4mg/l (95%ile) 8mg/l (MAC)",8640,null,null,null,null,null,null,null,null,null,null,null,null,null,null,null,null,null,null,null,null,2.94,null,null,null,null,null,null,"Discharge to Woldgrift Drain 2016 candidate SA(E)"]
["EAN02349","Changed",null,null,null,"WQ","Anglian","East Anglia","Anglian Water Services Ltd","7AW201925","Burrough Green STW","River Stour","GB105036040980","river","Stour",null,null,null,"WFD_IMPg","Phosphorus",null,null,null,null,"Continuous Discharge","2024-12-22","Amber","AEENF1574",564790,255230,null,null,null,null,null,null,null,null,null,null,null,null,null,null,null,null,null,null,null,null,null,null,null,null,null,null,null,null,null,null,216,null,0.8,"Iron\n4000 ug/l (95%ile)\n8000 ug/l (UT)",68,null,null,null,null,null,null,null,null,null,null,null,null,null,null,null,null,null,null,null,null,6.8,null,null,null,null,null,null,"Cost beneficial.  6.8 (measured to next sig discharge)",null,null,2.351,1,1,1,"WWN","£m",1]
["EAN02350","Changed",null,null,null,"WQ","Anglian","East Anglia","Anglian Water Services Ltd","7AW201926","Stradishall - Highpoint STW","River Stour","GB105036040980","river","Stour",null,null,null,"WFD_IMPg","Phosphorus",null,null,null,null,"Continuous Discharge","2024-12-22","Amber","ASENF12305",571610,251490,null,null,null,null,null,null,null,null,null,null,null,null,null,null,null,null,null,null,null,null,null,null,null,null,null,null,null,null,null,null,1194,null,0.5,"Iron\n4000 ug/l (95%ile)\n8000 ug/l (UT)",517,null,null,null,null,null,null,null,null,null,null,null,null,null,null,null,null,null,null,null,null,5,null,null,null,null,null,null,"Cost beneficial.  5 (to confluence).  Details corrected for WINEP3",null,null,2.5670000000000002,1,1,1,"WWN","£m",1]
["EAN02352","Changed",null,null,null,"WQ","Anglian","East Anglia","Anglian Water Services Ltd","7AW201928","Great Cornard STW","Stour US Lamarsh","GB105036040941","river","Stour",null,null,null,"WFD_IMPg","Phosphorus",null,null,null,null,"Continuous Discharge","2024-12-22","Amber","AW2NF148",588600,238020,null,null,null,null,null,null,null,null,null,null,null,null,null,null,null,null,null,null,null,null,null,null,null,null,null,null,null,null,null,null,9311,"2",0.25,"No change required",2450,null,null,null,null,null,null,null,null,null,null,null,null,null,null,null,null,null,null,null,null,10,0.95,null,95,null,null,null,"Cost beneficial.  The bundle of schemes on the Stour also ensures Abberton Reservoir will meet good for P (Stour is the main input). Lake env outcome calculated as area of Abberton divided by 5 main discharges for getting to good at the reservoir.  10 (50% of distance to next sig discharge, contribution equal to sudbury so divided between them)",null,null,4.157,1,1,1,"WWN","£m",1]
["EAN02353","Changed",null,null,null,"WQ","Anglian","East Anglia","Anglian Water Services Ltd","7AW201929","Great Waldingfield STW","River Box","GB105036040920","river","Stour",null,null,null,"WFD_IMPg","Phosphorus",null,null,null,null,"Continuous Discharge","2024-12-22","Amber","ASENF2061",591280,244340,null,null,null,null,null,null,null,null,null,null,null,null,null,null,null,null,null,null,null,null,null,null,null,null,null,null,null,null,null,null,2297,null,0.7,"Iron\n4000 ug/l (95%ile)\n8000 ug/l (UT)",470,null,null,null,null,null,null,null,null,null,null,null,null,null,null,null,null,null,null,null,null,15.6,0.95,null,95,null,null,null,"Cost beneficial.  The bundle of schemes on the Stour also ensures Abberton Reservoir will meet good for P (Stour is the main input). Lake env outcome calculated as area of Abberton divided by 5 main discharges for getting to good at the reservoir.  15.6 (to end of WB)",null,null,2.66,1,1,1,"WWN","£m",1]
["EAN02354","Changed",null,null,null,"WQ","Anglian","East Anglia","Anglian Water Services Ltd","7AW201930","Hadleigh STW","Brett","GB105036040930","river","Stour",null,null,null,"WFD_IMPg","Phosphorus",null,null,null,null,"Continuous Discharge","2024-12-22","Amber","ASENF1090",602986,241513,null,null,null,null,null,null,null,null,null,null,null,null,null,null,null,null,null,null,null,null,null,null,null,null,null,null,null,null,null,null,7387,1,0.25,"No change required",1700,null,null,null,null,null,null,null,null,null,null,null,null,null,null,null,null,null,null,null,null,8.6,0.95,null,95,null,null,null,"Cost beneficial.  The bundle of schemes on the Stour also ensures Abberton Reservoir will meet good for P (Stour is the main input). Lake env outcome calculated as area of Abberton divided by 5 main discharges for getting to good at the reservoir.  8.6 (to end of WB and confluence)",null,null,3.2749999999999999,1,1,1,"WWN","£m",1]
["EAN02355","Changed",null,null,null,"WQ","Anglian","East Anglia","Anglian Water Services Ltd","7AW201931","Haverhill STW","Stour Brook","GB105036040950","river","Stour",null,null,null,"WFD_IMPg","Phosphorus",null,null,null,null,"Continuous Discharge","2024-12-22","Amber","AW2NF342",568090,244820,null,null,null,null,null,null,null,null,null,null,null,null,null,null,null,null,null,null,null,null,null,null,null,null,null,null,null,null,null,null,29491,"2",0.25,"No change required",5700,null,null,null,null,null,null,null,null,null,null,null,null,null,null,null,null,null,null,null,null,8.8000000000000007,0.95,null,95,null,null,null,"Cost beneficial.  The bundle of schemes on the Stour also ensures Abberton Reservoir will meet good for P (Stour is the main input). Lake env outcome calculated as area of Abberton divided by 5 main discharges for getting to good at the reservoir. 8.8 (to end of WB)",null,null,7.2969999999999997,1,1,1,"WWN","£m",1]
["EAN02356","Changed",null,null,null,"WQ","Anglian","East Anglia","Anglian Water Services Ltd","7AW201932","Hundon STW","Chilton Brook","GB105036040960","river","Stour",null,null,null,"WFD_IMPg","Phosphorus",null,null,null,null,"Continuous Discharge","2024-12-22","Amber","ASENF1291",574300,248000,null,null,null,null,null,null,null,null,null,null,null,null,null,null,null,null,null,null,null,null,null,null,null,null,null,null,null,null,null,null,892,null,0.4,"Iron\n4000 ug/l (95%ile)\n8000 ug/l (UT)",250,null,null,null,null,null,null,null,null,null,null,null,null,null,null,null,null,null,null,null,null,5,null,null,null,null,null,null,"Cost beneficial.  5 (to end of WB)",null,null,2.8130000000000002,1,1,1,"WWN","£m",1]
["EAN02357","Changed",null,null,null,"WQ","Anglian","East Anglia","Anglian Water Services Ltd","7AW201933","Kedington STW","River Stour","GB105036040980","river","Stour",null,null,null,"WFD_IMPg","Phosphorus",null,null,null,null,"Continuous Discharge","2024-12-22","Amber","ASENF1292",570780,245960,null,null,null,null,null,null,null,null,null,null,null,null,null,null,null,null,null,null,null,null,null,null,null,null,null,null,null,null,null,null,2241,null,1,"Iron\n4000 ug/l (95%ile)\n8000 ug/l (UT)",600,null,null,null,null,null,null,null,null,null,null,null,null,null,null,null,null,null,null,null,null,2.5,null,null,null,null,null,null,"Cost beneficial.  2.5 (to next confluence)",null,null,0.09,1,1,1,"WWN","£m",1]
["EAN02358","Changed",null,null,null,"WQ","Anglian","East Anglia","Anglian Water Services Ltd","7AW201934","Langham (Essex) STW","Lower Stour","GB105036041000","river","Stour",null,null,null,"WFD_IMPg","Phosphorus",null,null,null,null,"Continuous Discharge","2024-12-22","Amber","ASENF1116",602220,232400,null,null,null,null,null,null,null,null,null,null,null,null,null,null,null,null,null,null,null,null,null,null,null,null,null,null,null,null,null,null,1710,null,1,"Iron\n4000 ug/l (95%ile)\n8000 ug/l (UT)",420,null,null,null,null,null,null,null,null,null,null,null,null,null,null,null,null,null,null,null,null,5.5,null,null,null,null,null,null,"Cost beneficial.  5.5 (to confluence)",null,null,0.97599999999999998,1,1,1,"WWN","£m",1]
["EAN02360","Changed",null,null,null,"WQ","Anglian","East Anglia","Anglian Water Services Ltd","7AW201936","Steeple Bumpstead STW","Bumpstead Brook","GB105036040910","river","Stour",null,null,null,"WFD_IMPg","Phosphorus",null,null,null,null,"Continuous Discharge","2024-12-22","Amber","ASENF1543",568390,241630,null,null,null,null,null,null,null,null,null,null,null,null,null,null,null,null,null,null,null,null,null,null,null,null,null,null,null,null,null,null,1761,null,0.6,"Iron\n4000 ug/l (95%ile)\n8000 ug/l (UT)",320,null,null,null,null,null,null,null,null,null,null,null,null,null,null,null,null,null,null,null,null,3.4,null,null,null,null,null,null,"Cost beneficial.  3.4 (to end of WB)",null,null,1.8380000000000001,1,1,1,"WWN","£m",1]
["EAN02361","Changed",null,null,null,"WQ","Anglian","East Anglia","Anglian Water Services Ltd","7AW201937","Sudbury STW","Stour US Lamarsh","GB105036040941","river","Stour",null,null,null,"WFD_IMPg","Phosphorus",null,null,null,null,"Continuous Discharge","2024-12-22","Amber","ASENF1314",586353,241176,null,null,null,null,null,null,null,null,null,null,null,null,null,null,null,null,null,null,null,null,null,null,null,null,null,null,null,null,null,null,15430,"2",0.8,"No change required",3441,null,null,null,null,null,null,null,null,null,null,null,null,null,null,null,null,null,null,null,null,15.3,0.95,null,95,null,null,null,"Cost beneficial.  The bundle of schemes on the Stour also ensures Abberton Reservoir will meet good for P (Stour is the main input). Lake env outcome calculated as area of Abberton divided by 5 main discharges for getting to good at the reservoir.  15.3 (to next discharge and 50% of distance to next confluence as 50% contributor)",null,null,1.8380000000000001,1,1,1,"WWN","£m",1]
["EAN02362","Changed",null,null,null,"WQ","Anglian","East Anglia","Anglian Water Services Ltd","7AW201938","Thurlow STW","River Stour","GB105036040980","river","Stour",null,null,null,"WFD_IMPg","Phosphorus",null,null,null,null,"Continuous Discharge","2024-12-22","Amber","AW2NF349",567970,250960,null,null,null,null,null,null,null,null,null,null,null,null,null,null,null,null,null,null,null,null,null,null,null,null,null,null,null,null,null,null,1204,null,1,"Iron\n4000 ug/l (95%ile)\n8000 ug/l (UT)",140,null,null,null,null,null,null,null,null,null,null,null,null,null,null,null,null,null,null,null,null,3.8,null,null,null,null,null,null,"Cost beneficial.  3.8 (to next sig discharge)",null,null,0.22500000000000001,1,1,1,"WWN","£m",1]
["EAN02363","Changed",null,null,null,"WQ","Anglian","East Anglia","Anglian Water Services Ltd","7AW201939","Wickham Brook STW","Glem","GB105036046400","river","Stour",null,null,null,"WFD_IMPg","Phosphorus",null,null,null,null,"Continuous Discharge","2024-12-22","Amber","ASENF10450",574980,254980,null,null,null,null,null,null,null,null,null,null,null,null,null,null,null,null,null,null,null,null,null,null,null,null,null,null,null,null,null,null,2080,null,2.5,"Iron\n4000 ug/l (95%ile)\n8000 ug/l (UT)",338,null,null,null,null,null,null,null,null,null,null,null,null,null,null,null,null,null,null,null,null,8,null,null,null,null,null,null,"Cost beneficial.  8 (to confluence)",null,null,1.1990000000000001,1,1,1,"WWN","£m",1]
["EAN02364","Changed",null,null,null,"WQ","Anglian","East Anglia","Anglian Water Services Ltd","7AW201940","Withersfield STW","Stour Brook","GB105036040950","river","Stour",null,null,null,"WFD_IMPg","Phosphorus",null,null,null,null,"Continuous Discharge","2024-12-22","Amber","AW2NF518",565400,247200,null,null,null,null,null,null,null,null,null,null,null,null,null,null,null,null,null,null,null,null,null,null,null,null,null,null,null,null,null,null,767,null,0.8,"Iron\n4000 ug/l (95%ile)\n8000 ug/l (UT)",82,null,null,null,null,null,null,null,null,null,null,null,null,null,null,null,null,null,null,null,null,3.9,null,null,null,null,null,null,"Cost beneficial.  3.9 (to next sig discharge)",null,null,1.3680000000000001,1,1,1,"WWN","£m",1]
["LNA00049","Changed",null,null,null,"WQ","Anglian","Lincolnshire and Northamptonshire","Anglian Water Services Ltd","7AW201955","Brixworth STW","Brampton Branch - Upper","GB105032045540","River","Brampton Branch",null,null,null,"WFD_IMPm","Phosphorus","SSSI_IMP","Phosphorus",null,null,"Continuous Discharge","2024-12-22","Amber","AWNNF13599",473790,271290,null,null,null,null,"UPPER NENE VALLEY GRAVEL PITS","Upper Nene Valley Gravel Pits (SPA)","SSSI unit ID 008, Ramsar ID UK11083",60,"New targets required to meet conservation objective standards since PR14 (CSMG)",null,null,null,null,null,null,null,null,null,null,null,null,null,null,null,null,null,null,null,null,null,5822,null,"0.25mg/l (AA)","Total Iron= 4mg/l (95%ile) 8mg/l (MAC)",1563,null,null,null,null,null,"",null,null,null,null,null,null,null,null,null,null,null,null,null,null,4.0199999999999996,null,null,69.2,null,null,null,"Permit limit for good is below TAL. Part of cost beneficial bundle for operational catchment. This also contributes to SSSI_IMP for Rutland Water. Environmental outcome includes both river length and SSSI's "]
["LNA00050","Changed","Yes – alteration made",null,null,"WQ","Anglian","Lincolnshire and Northamptonshire","Anglian Water Services Ltd","7AW201956","Broadholme STW","Nene - conf Ise to Islip","GB105032050383","River","Nene Middle",null,null,null,"WFD_IMPg","Phosphorus","SSSI_IMP","Phosphorus",null,null,"Continuous Discharge","2024-12-22","Amber","AWNNF13399",494100,268580,null,null,null,null,"UPPER NENE VALLEY GRAVEL PITS","Upper Nene Valley Gravel Pits (SPA)","SSSI unit ID 008, Ramsar ID UK11083",60,"New targets required to meet conservation objective standards since PR14 (CSMG)",null,null,null,null,null,null,null,null,null,null,null,null,null,null,null,null,null,null,null,null,null,227332,"1mg/l","0.25mg/l (AA)","Total Iron: 4mg/l (95%ile) 8mg/l (MAC)",42856,null,null,null,null,null,"",null,null,null,null,null,null,null,null,null,null,null,null,null,null,17.100000000000001,null,null,69.2,null,null,null,"Part of cost beneficial bundle for the operational catchment. This also contributes to SSSI_IMP for Rutland Water.  Environmental outcome includes both river length and SSSI's "]
["LNA00054","Changed",null,null,null,"WQ","Anglian","Lincolnshire and Northamptonshire","Anglian Water Services Ltd","7AW201960","Clipston STW","Ise - Upper","GB105032045200","River","Ise",null,null,null,"WFD_IMPg","Phosphorus","SSSI_IMP","Phosphorus",null,null,"Continuous Discharge","2024-12-22","Amber","AWNNF1269",471820,281730,null,null,null,null,"RIVER ISE AND MEADOWS",null,"SSSI unit ID 003",13.536292,"New targets required to meet conservation objective standards since PR14 (CSMG)",null,null,null,null,null,null,null,null,null,null,null,null,null,null,null,null,null,null,null,null,null,559,null,"0.3mg/l (AA)","Total Iron= 4mg/l (95%ile) 8mg/l (MAC)",120,null,null,null,null,null,"",null,null,null,null,null,null,null,null,null,null,null,null,null,null,10.5,null,null,73.760000000000005,null,null,null,"Part of cost beneficial bundle of measures for operational catchment.  Scheme also benefits Upper Nene Gravel Pits SSSI unit ID 003 & Rutland Water SSSI. SSSI Unit ID – 029, 030 and 031, Ramsar ID UK11062. Environmental outcomes columns include benefit to river and SSSI's",null,null,3.5579999999999998,1,1,1,"WWN","£m",1]
["LNA00055","Changed",null,null,null,"WQ","Anglian","Lincolnshire and Northamptonshire","Anglian Water Services Ltd","7AW201961","Corby STW","Southern Stream","GB105032045580","River","Willow Brook",null,null,null,"WFD_IMPm","Phosphorus","SSSI_IMP","Phosphorus",null,null,"Continuous Discharge",null,"Amber","AW5NF5179",490760,288840,null,null,null,null,"RUTLAND WATER","Rutland Water (SPA)","SSSI Unit ID – 029, 030 and 031, Ramsar ID UK11062",1212,"New targets required to meet conservation objective standards since PR14 (CSMG)",null,null,null,null,null,null,null,null,null,null,null,null,null,null,null,null,null,null,null,null,null,110476,"1mg/l","0.25mg/l (AA)","Total Iron= 2.5mg/l (95%ile) 8mg/l (MAC)",18454,null,null,null,null,null,"",null,null,null,null,null,null,null,null,null,null,null,null,null,null,28.19,null,null,63.8,null,null,null,"Permit limit to achieve good status beyond TAL. Part of cost beneficial bundle of measures for operational catchment. Environmental outcomes include improvement to river and SSSI"]
["LNA00057","Changed",null,null,null,"WQ","Anglian","Lincolnshire and Northamptonshire","Anglian Water Services Ltd","7AW201963","Draughton STW","Brampton Branch - Upper","GB105032045540","River","Brampton Branch",null,null,null,"WFD_IMPg","Phosphorus","SSSI_IMP","Phosphorus",null,null,"Continuous Discharge","2024-12-22","Amber","AW5NF5221",475456,276885,null,null,null,null,"UPPER NENE VALLEY GRAVEL PITS","Upper Nene Valley Gravel Pits (SPA)","SSSI unit ID 008, Ramsar ID UK11083",60,"New targets required to meet conservation objective standards since PR14 (CSMG)",null,null,null,null,null,null,null,null,null,null,null,null,null,null,null,null,null,null,null,null,null,701,null,"0.3mg/l (AA)","Total Iron= 4mg/l (95%ile) 8mg/l (MAC)",150,null,null,null,null,null,"",null,null,null,null,null,null,null,null,null,null,null,null,null,null,3.64,null,null,69.2,null,null,null,"Part of cost beneficial bundle of measures for operational catchment. This also contributes to SSSI_IMP for Rutland Water.  Environmental outcome includes both river length and SSSI's ",null,null,3.6179999999999999,1,1,1,"WWN","£m",1]
["LNA00058","Changed",null,null,null,"WQ","Anglian","Lincolnshire and Northamptonshire","Anglian Water Services Ltd","7AW201964","East Haddon STW","Ravensthopre Arm of Spratton Brook","GB105032045490","River","Brampton Branch",null,null,null,"WFD_IMPg","Phosphorus","SSSI_IMP","Phosphorus",null,null,"Continuous Discharge","2024-12-22","Amber","AWNNF13400",467240,268490,null,null,null,null,"UPPER NENE VALLEY GRAVEL PITS","Upper Nene Valley Gravel Pits (SPA)","SSSI unit ID 008, Ramsar ID UK11083",60,"New targets required to meet conservation objective standards since PR14 (CSMG)",null,null,null,null,null,null,null,null,null,null,null,null,null,null,null,null,null,null,null,null,null,604,null,"0.7mg/l (AA)","Total Iron=4mg/l (95%ile) 8mg/l (MAC)",118,null,null,null,null,null,"",null,null,null,null,null,null,null,null,null,null,null,null,null,null,0.71,null,null,69.2,null,null,null,"Part of cost beneficial bundle for operational catchment. This also contributes to SSSI_IMP for Rutland Water.  Environmental outcome includes both river length and SSSI's ",null,null,1.8580000000000001,1,1,1,"WWN","£m",1]
["LNA00060","Changed",null,null,null,"WQ","Anglian","Lincolnshire and Northamptonshire","Anglian Water Services Ltd","7AW201966","Geddington STW","Ise - Upper","GB105032045200","River","Ise",null,null,null,"WFD_IMPg","Phosphorus","SSSI_IMP","Phosphorus",null,null,"Continuous Discharge","2024-12-22","Amber","AW5NF94",489450,282280,null,null,null,null,"UPPER NENE VALLEY GRAVEL PITS","Upper Nene Valley Gravel Pits (SPA)","SSSI unit ID 008, Ramsar ID UK11083",60,"New targets required to meet conservation objective standards since PR14 (CSMG)",null,null,null,null,null,null,null,null,null,null,null,null,null,null,null,null,null,null,null,null,null,1871,null,"0.9 mg/l (AA)","Total Iron= 4mg/l (95%ile) 8mg/l (MAC)",616,null,null,null,null,null,"",null,null,null,null,null,null,null,null,null,null,null,null,null,null,7.58,null,null,69.2,null,null,null,"Part of cost beneficial bundle of measures for operational catchment. Scheme also benefits Rutland Water SSSI. SSSI Unit ID – 029, 030 and 031, Ramsar ID UK11062.  Environmental outcome includes both river length and SSSI's ",null,null,1.762,1,1,1,"WWN","£m",1]
["LNA00062","Changed",null,null,null,"WQ","Anglian","Lincolnshire and Northamptonshire","Anglian Water Services Ltd","7AW201968","Great Oxendon STW","Ise - Upper","GB105032045200","River","Ise",null,null,null,"WFD_IMPg","Phosphorus","SSSI_IMP","Phosphorus",null,null,"Continuous Discharge","2024-12-22","Amber","AWNNF13652",473380,282350,null,null,null,null,"RIVER ISE AND MEADOWS",null,"SSSI unit ID 003",13.536292,"New targets required to meet conservation objective standards since PR14 (CSMG)",null,null,null,null,null,null,null,null,null,null,null,null,null,null,null,null,null,null,null,null,null,588,null,"0.4 mg/l (AA)","Total Iron= 4mg/l (95%ile) 8mg/l (MAC)",119,null,null,null,null,null,"",null,null,null,null,null,null,null,null,null,null,null,null,null,null,7.21,null,null,73.760000000000005,null,null,null,"Part of cost beneficial bundle of measures for operational catchment.  Scheme also benefits Upper Nene Gravel Pits SSSI unit ID 003 & Rutland Water SSSI. SSSI Unit ID – 029, 030 and 031, Ramsar ID UK11062. Environmental outcomes columns include benefit to river and SSSI's",null,null,2.875,1,1,1,"WWN","£m",1]
["LNA00063","Changed",null,null,null,"WQ","Anglian","Lincolnshire and Northamptonshire","Anglian Water Services Ltd","7AW201969","Hackleton STW","Wootton Brook","GB105032045550","River","Nene Upper",null,null,null,"WFD_IMPg","Phosphorus","SSSI_IMP","Phosphorus",null,null,"Continuous Discharge","2024-12-22","Amber","AW5NF114",479525,255328,null,null,null,null,"UPPER NENE VALLEY GRAVEL PITS","Upper Nene Valley Gravel Pits (SPA)","SSSI unit ID 008, Ramsar ID UK11083",60,"New targets required to meet conservation objective standards since PR14 (CSMG)",null,null,null,null,null,null,null,null,null,null,null,null,null,null,null,null,null,null,null,null,null,1862,null,"0.5mg/l (AA)","Total Iron= 4mg/l (95%ile) 8mg/l (MAC)",500,null,null,null,null,null,"",null,null,null,null,null,null,null,null,null,null,null,null,null,null,7.45,null,null,69.2,null,null,null,"Part of cost beneficial bundle of measures for operational catchment. Scheme also benefits Rutland Water SSSI. SSSI Unit ID – 029, 030 and 031, Ramsar ID UK11062.  Environmental outcome includes both river length and SSSI's ",null,null,1.911,1,1,1,"WWN","£m",1]
["LNA00065","Changed",null,null,null,"WQ","Anglian","Lincolnshire and Northamptonshire","Anglian Water Services Ltd","7AW201971","Hollowell STW","Hollowell Arm of Spratton Brook","GB105032045510","River","Brampton Branch",null,null,null,"WFD_IMPg","Phosphorus","SSSI_IMP","Phosphorus",null,null,"Continuous Discharge","2024-12-22","Amber","AW5NF254",469500,271900,null,null,null,null,"UPPER NENE VALLEY GRAVEL PITS","Upper Nene Valley Gravel Pits (SPA)","SSSI unit ID 008, Ramsar ID UK11083",60,"New targets required to meet conservation objective standards since PR14 (CSMG)",null,null,null,null,null,null,null,null,null,null,null,null,null,null,null,null,null,null,null,null,null,2023,null,"0.25mg/l (AA)","Total Iron= 4mg/l (95%ile) 8mg/l (MAC)",680,null,null,null,null,null,"",null,null,null,null,null,null,null,null,null,null,null,null,null,null,3.12,null,null,69.2,null,null,null,"Part of cost beneficial bundle of measures for operational catchment. This also contributes to SSSI_IMP for Rutland Water.  Environmental outcome includes both river length and SSSI's "]
["LNA00074","Changed",null,null,null,"WQ","Anglian","Lincolnshire and Northamptonshire","Anglian Water Services Ltd","7AW201980","Ravensthorpe STW","Ravensthopre Arm of Spratton Brook","GB105032045490","River","Brampton Branch",null,null,null,"WFD_IMPg","Phosphorus","SSSI_IMP","Phosphorus",null,null,"Continuous Discharge","2024-12-22","Amber","AW5NF139",467480,269920,null,null,null,null,"UPPER NENE VALLEY GRAVEL PITS","Upper Nene Valley Gravel Pits (SPA)","SSSI unit ID 008, Ramsar ID UK11083",60,"New targets required to meet conservation objective standards since PR14 (CSMG)",null,null,null,null,null,null,null,null,null,null,null,null,null,null,null,null,null,null,null,null,null,951,null,"1mg/l (AA)","Total Iron= 4mg/l (95%ile) 8mg/l (MAC)",120,null,null,null,null,null,"",null,null,null,null,null,null,null,null,null,null,null,null,null,null,1.07,null,null,69.2,null,null,null,"Part of cost beneficial bundle of measures for operational catchment. This also contributes to SSSI_IMP for Rutland Water.  Environmental outcome includes both river length and SSSI's ",null,null,1.242,1,1,1,"WWN","£m",1]
["LNA00077","Changed",null,null,null,"WQ","Anglian","Lincolnshire and Northamptonshire","Anglian Water Services Ltd","7AW201983","Titchmarsh STW","Thorpe Waterville Brook","GB105032045190","River","Nene Middle",null,null,null,"WFD_IMPg","Phosphorus","SSSI_IMP","Phosphorus",null,null,"Continuous Discharge","2024-12-22","Amber","AW5NF5212",503200,279770,null,null,null,null,"RUTLAND WATER","Rutland Water (SPA)","SSSI Unit ID – 029, 030 and 031, Ramsar ID UK11062",1212,"New targets required to meet conservation objective standards since PR14 (CSMG)",null,null,null,null,null,null,null,null,null,null,null,null,null,null,null,null,null,null,null,null,null,631,null,"1mg/l (AA)","Total Iron: 4mg/l (95%ile) 8mg/l (MAC)",95,null,null,null,null,null,"",null,null,null,null,null,null,null,null,null,null,null,null,null,null,2.41,null,null,63.8,null,null,null,"Part of cost beneficial bundle for the operational catchment. Environmental outcomes include improvement to river and SSSI",null,null,1.284,1,1,1,"WWN","£m",1]
["LNA00081","Changed",null,null,null,"WQ","Anglian","Lincolnshire and Northamptonshire","Anglian Water Services Ltd","7AW201987","Wittering STW","Wittering Brook","GB105032050360","River","Nene Middle",null,null,null,"WFD_IMPm","Phosphorus",null,null,null,null,"Continuous Discharge","2024-12-22","Amber","AW5NF336",505460,301280,null,null,null,null,null,null,null,null,null,null,null,null,null,null,null,null,null,null,null,null,null,null,null,null,null,null,null,null,null,null,4312,null,"0.25mg/l (AA)","Total Iron: 4mg/l (95%ile) 8mg/l (MAC)",810,null,null,null,null,null,"",null,null,null,null,null,null,null,null,null,null,null,null,null,null,4.78,null,null,null,null,null,null,"Permit limit required for good status is beyond TAL.Part of cost beneficial bundle for the operational catchment"]
["LNA00109","Changed",null,null,null,"WQ","Anglian","Lincolnshire and Northamptonshire","Anglian Water Services Ltd","7AW202005","Alford STW","Woldgrift Drain","GB105029061750","River","Steeping and Eaus",null,null,null,"WFD_IMPg","Phosphorus",null,null,null,null,"Continuous Discharge","2024-12-22","Amber","AW3NF131",546151,375973,null,null,null,null,null,null,null,null,null,null,null,null,null,null,null,null,null,null,null,null,null,null,null,null,null,null,null,null,null,null,3694,null,"0.25mg/l (AA)","Total Iron= 4mg/l (95%ile) 8mg/l (MAC)",1150,null,null,null,null,null,"",null,null,null,null,null,null,null,null,null,null,null,null,null,null,7.61,null,null,null,null,null,null,"Part of cost beneficial bundle for catchment",null,null,3.137,1,1,1,"WWN","£m",1]
["LNA00112","Changed",null,null,null,"WQ","Anglian","Lincolnshire and Northamptonshire","Anglian Water Services Ltd","7AW202008","Anderby STW","Anderby Main Drain","GB105029061730","River","Steeping and Eaus",null,null,null,"WFD_IMPg","Phosphorus",null,null,null,null,"Continuous Discharge","2024-12-22","Amber","ANNNF13611",553930,376010,null,null,null,null,null,null,null,null,null,null,null,null,null,null,null,null,null,null,null,null,null,null,null,null,null,null,null,null,null,null,438,null,"1mg/l (AA)","Total Iron= 4mg/l (95%ile) 8mg/l (MAC)",90,null,null,null,null,null,"",null,null,null,null,null,null,null,null,null,null,null,null,null,null,1.38,null,null,null,null,null,null,"Part of cost beneficial bundle for catchment",null,null,1.2549999999999999,1,1,1,"WWN","£m",1]
["LNA00120","Changed",null,null,null,"WQ","Anglian","Lincolnshire and Northamptonshire","Anglian Water Services Ltd","7AW202016","Caythorpe STW","Honington Beck","GB105030056750","River","Witham Upper",null,null,null,"WFD_IMPg","Phosphorus",null,null,null,null,"Continuous Discharge","2024-12-22","Amber","ANNNF1037",494360,347140,null,null,null,null,null,null,null,null,null,null,null,null,null,null,null,null,null,null,null,null,null,null,null,null,null,null,null,null,null,null,1159,null,"0.8mg/l (AA)","Total Iron= 4mg/l (95%ile) 8mg/l (MAC)",360,null,null,null,null,null,"",null,null,null,null,null,null,null,null,null,null,null,null,null,null,4.2300000000000004,null,null,null,null,null,null,"Part of cost beneficial bundle for catchment",null,null,2.0409999999999999,1,1,1,"WWN","£m",1]
["LNA00121","Changed",null,null,null,"WQ","Anglian","Lincolnshire and Northamptonshire","Anglian Water Services Ltd","7AW202017","Colsterworth STW","Witham - Headwaters to conf Cringle BK","GB105030051570","River","Witham Upper",null,null,null,"WFD_IMPg","Phosphorus",null,null,null,null,"Continuous Discharge","2024-12-22","Amber","ANNNF1047",492810,324760,null,null,null,null,null,null,null,null,null,null,null,null,null,null,null,null,null,null,null,null,null,null,null,null,null,null,null,null,null,null,1723,null,"0.5mg/l (AA)","Total Iron= 4mg/l (95%ile) 8mg/l (MAC)",360,null,null,null,null,null,"",null,null,null,null,null,null,null,null,null,null,null,null,null,null,7.94,null,null,null,null,null,null,"Part of cost beneficial bundle for catchment",null,null,2.0760000000000001,1,1,1,"WWN","£m",1]
["LNA00123","Changed",null,null,null,"WQ","Anglian","Lincolnshire and Northamptonshire","Anglian Water Services Ltd","7AW202019","Corringham STW","Till (Witham)","GB105030062500","River","Witham Upper",null,null,null,"WFD_IMPg","Phosphorus",null,null,null,null,"Continuous Discharge","2024-12-22","Amber","AW3NF100",487100,390600,null,null,null,null,null,null,null,null,null,null,null,null,null,null,null,null,null,null,null,null,null,null,null,null,null,null,null,null,null,null,588,null,"1mg/l (AA)","Total Iron= 4mg/l (95%ile) 8mg/l (MAC)",82,null,null,null,null,null,"",null,null,null,null,null,null,null,null,null,null,null,null,null,null,1.63,null,null,null,null,null,null,"Part of cost beneficial bundle for catchment",null,null,1.5840000000000001,1,1,1,"WWN","£m",1]
["LNA00127","Changed",null,null,null,"WQ","Anglian","Lincolnshire and Northamptonshire","Anglian Water Services Ltd","7AW202023","Dunholme STW","Barlings Eau","GB105030062290","River","Witham Lower",null,null,null,"WFD_IMPg","Phosphorus",null,null,null,null,"Continuous Discharge","2024-12-22","Amber","ANNNF10274",503460,379630,null,null,null,null,null,null,null,null,null,null,null,null,null,null,null,null,null,null,null,null,null,null,null,null,null,null,null,null,null,null,5817,null,"0.25mg/l (AA)","Total Iron= 4mg/l (95%ile) 8mg/l (MAC)",1509,null,null,null,null,null,"",null,null,null,null,null,null,null,null,null,null,null,null,null,null,3.8,null,null,null,null,null,null,"Part of cost beneficial bundle for catchment",null,null,3.25,1,1,1,"WWN","£m",1]
["LNA00128","Changed",null,null,null,"WQ","Anglian","Lincolnshire and Northamptonshire","Anglian Water Services Ltd","7AW202024","Dunsby STW","Old Beck","GB105030051540","River","South Forty Foot Drain",null,null,null,"WFD_IMPm","Phosphorus",null,null,null,null,"Continuous Discharge","2024-12-22","Amber","AW5NF5201",510510,327560,null,null,null,null,null,null,null,null,null,null,null,null,null,null,null,null,null,null,null,null,null,null,null,null,null,null,null,null,null,null,1498,null,"0.25mg/l (AA)","Total Iron= 4mg/l (95%ile) 8mg/l (MAC)",607,null,null,null,null,null,"",null,null,null,null,null,null,null,null,null,null,null,null,null,null,8.3000000000000007,null,null,null,null,null,null,"Part of cost beneficial bundle for catchment",null,null,4.4740000000000002,1,1,1,"WWN","£m",1]
["LNA00130","Changed",null,null,null,"WQ","Anglian","Lincolnshire and Northamptonshire","Anglian Water Services Ltd","7AW202026","Faldingworth STW","Legsby Beck","GB105030062330","River","Witham Lower",null,null,null,"WFD_IMPg","Phosphorus",null,null,null,null,"Continuous Discharge","2024-12-22","Amber","AW3NF60A",507100,384200,null,null,null,null,null,null,null,null,null,null,null,null,null,null,null,null,null,null,null,null,null,null,null,null,null,null,null,null,null,null,305,null,"1mg/l (AA)","Total Iron= 4mg/l (95%ile) 8mg/l (MAC)",0,null,null,null,null,null,"",null,null,null,null,null,null,null,null,null,null,null,null,null,null,6.51,null,null,null,null,null,null,"Part of cost beneficial bundle for catchment",null,null,1.581,1,1,1,"WWN","£m",1]
["LNA00135","Changed",null,null,null,"WQ","Anglian","Lincolnshire and Northamptonshire","Anglian Water Services Ltd","7AW202031","Fulbeck STW","Fulbeck Beck","GB105030056120","River","Witham Upper",null,null,null,"WFD_IMPg","Phosphorus",null,null,null,null,"Continuous Discharge","2024-12-22","Amber","ANNNF13059",494060,350720,null,null,null,null,null,null,null,null,null,null,null,null,null,null,null,null,null,null,null,null,null,null,null,null,null,null,null,null,null,null,463,null,"0.3mg/l (AA)","Total Iron= 4mg/l (95%ile) 8mg/l (MAC)",95,null,null,null,null,null,"",null,null,null,null,null,null,null,null,null,null,null,null,null,null,5.38,null,null,null,null,null,null,"Part of cost beneficial bundle for catchment",null,null,3.4929999999999999,1,1,1,"WWN","£m",1]
["LNA00137","Changed",null,null,null,"WQ","Anglian","Lincolnshire and Northamptonshire","Anglian Water Services Ltd","7AW202033","Glentworth STW","Fillingham Beck","GB105030062490","River","Witham Upper",null,null,null,"WFD_IMPg","Phosphorus",null,null,null,null,"Continuous Discharge","2024-12-22","Amber","AW3NF112",494320,387880,null,null,null,null,null,null,null,null,null,null,null,null,null,null,null,null,null,null,null,null,null,null,null,null,null,null,null,null,null,null,691,null,"1mg/l (AA)","Total Iron= 4mg/l (95%ile) 8mg/l (MAC)",220,null,null,null,null,null,"",null,null,null,null,null,null,null,null,null,null,null,null,null,null,2.44,null,null,null,null,null,null,"Part of cost beneficial bundle for catchment",null,null,0.157,1,1,1,"WWN","£m",1]
["LNA00138","Changed",null,null,null,"WQ","Anglian","Lincolnshire and Northamptonshire","Anglian Water Services Ltd","7AW202034","Great Ponton STW","Witham - conf cringle bk to conf brant","GB105030056780","River","Witham Upper",null,null,null,"WFD_IMPg","Phosphorus",null,null,null,null,"Continuous Discharge","2024-12-22","Amber","AW3NFF662",493100,330700,null,null,null,null,null,null,null,null,null,null,null,null,null,null,null,null,null,null,null,null,null,null,null,null,null,null,null,null,null,null,369,null,"1mg/l (AA)","Total Iron= 4mg/l (95%ile) 8mg/l (MAC)",100,null,null,null,null,null,"",null,null,null,null,null,null,null,null,null,null,null,null,null,null,6.97,null,null,null,null,null,null,"Part of cost beneficial bundle for catchment",null,null,0.159,1,1,1,"WWN","£m",1]
["LNA00140","Changed",null,null,null,"WQ","Anglian","Lincolnshire and Northamptonshire","Anglian Water Services Ltd","7AW202036","Harlaxton STW","Mow Beck","GB105030056720","River","Witham Upper",null,null,null,"WFD_IMPg","Phosphorus",null,null,null,null,"Continuous Discharge","2024-12-22","Amber","ANNNF1093",489150,333130,null,null,null,null,null,null,null,null,null,null,null,null,null,null,null,null,null,null,null,null,null,null,null,null,null,null,null,null,null,null,1100,null,"0.6mg/l (AA)","Total Iron= 4mg/l (95%ile) 8mg/l (MAC)",300,null,null,null,null,null,"",null,null,null,null,null,null,null,null,null,null,null,null,null,null,2.6,null,null,null,null,null,null,"Part of cost beneficial bundle for catchment",null,null,1.976,1,1,1,"WWN","£m",1]
["LNA00143","Changed",null,null,null,"WQ","Anglian","Lincolnshire and Northamptonshire","Anglian Water Services Ltd","7AW202039","Horbling STW","Ousemere Lode","GB105030056490","River","South Forty Foot Drain",null,null,null,"WFD_IMPg","Phosphorus",null,null,null,null,"Continuous Discharge","2024-12-22","Amber","AW5NF813",512300,334570,null,null,null,null,null,null,null,null,null,null,null,null,null,null,null,null,null,null,null,null,null,null,null,null,null,null,null,null,null,null,4033,null,"0.3mg/l (AA)","Total Iron= 4mg/l (95%ile) 8mg/l (MAC)",878,null,null,null,null,null,"",null,null,null,null,null,null,null,null,null,null,null,null,null,null,6.54,null,null,null,null,null,null,"Part of cost beneficial bundle for catchment",null,null,3.75,1,1,1,"WWN","£m",1]
["LNA00144","Changed",null,null,null,"WQ","Anglian","Lincolnshire and Northamptonshire","Anglian Water Services Ltd","7AW202040","Horncastle STW","Bain - Lower","GB105030062450","River","Witham Lower",null,null,null,"WFD_IMPg","Phosphorus",null,null,null,null,"Continuous Discharge","2024-12-22","Amber","ANNNF10519",525950,367440,null,null,null,null,null,null,null,null,null,null,null,null,null,null,null,null,null,null,null,null,null,null,null,null,null,null,null,null,null,null,9127,null,"0.25mg/l (AA)","Total Iron= 4mg/l (95%ile) 8mg/l (MAC)",2315,null,null,null,null,null,"",null,null,null,null,null,null,null,null,null,null,null,null,null,null,14,null,null,null,null,null,null,"Part of cost beneficial bundle for catchment",null,null,4.0199999999999996,1,1,1,"WWN","£m",1]
["LNA00149","Changed",null,null,null,"WQ","Anglian","Lincolnshire and Northamptonshire","Anglian Water Services Ltd","7AW202045","Legbourne STW","Long Eau","GB105029061670","River","Steeping and Eaus",null,null,null,"WFD_IMPg","Phosphorus",null,null,null,null,"Continuous Discharge","2024-12-22","Amber","AW3NF115",537000,384200,null,null,null,null,null,null,null,null,null,null,null,null,null,null,null,null,null,null,null,null,null,null,null,null,null,null,null,null,null,null,716,null,"0.8mg/l (AA)","Total Iron= 4mg/l (95%ile) 8mg/l (MAC)",157,null,null,null,null,null,"",null,null,null,null,null,null,null,null,null,null,null,null,null,null,6.24,null,null,null,null,null,null,"Part of cost beneficial bundle for catchment",null,null,1.6910000000000001,1,1,1,"WWN","£m",1]
["LNA00152","Changed",null,null,null,"WQ","Anglian","Lincolnshire and Northamptonshire","Anglian Water Services Ltd","7AW202048","Mablethorpe STW","Woldgrift Drain","GB105029061750","River","Steeping and Eaus",null,null,null,"WFD_IMPm","Phosphorus",null,null,null,null,"Continuous Discharge","2024-12-22","Amber","ANNNF13149",549120,382440,null,null,null,null,null,null,null,null,null,null,null,null,null,null,null,null,null,null,null,null,null,null,null,null,null,null,null,null,null,null,22371,null,"0.25mg/l (AA)","Total Iron= 4mg/l (95%ile) 8mg/l (MAC)",8640,null,null,null,null,null,"",null,null,null,null,null,null,null,null,null,null,null,null,null,null,2.94,null,null,null,null,null,null,"Part of cost beneficial bundle for catchment"]
["LNA00153","Changed",null,null,null,"WQ","Anglian","Lincolnshire and Northamptonshire","Anglian Water Services Ltd","7AW202049","Manby STW","Long Eau","GB105029061670","River","Steeping and Eaus",null,null,null,"WFD_IMPg","Phosphorus",null,null,null,null,"Continuous Discharge","2024-12-22","Amber","ANNNF2074",540730,386120,null,null,null,null,null,null,null,null,null,null,null,null,null,null,null,null,null,null,null,null,null,null,null,null,null,null,null,null,null,null,2164,null,"0.3mg/l (AA)","Total Iron= 4mg/l (95%ile) 8mg/l (MAC)",894,null,null,null,null,null,"",null,null,null,null,null,null,null,null,null,null,null,null,null,null,8.34,null,null,null,null,null,null,"Part of cost beneficial bundle for catchment",null,null,2.9990000000000001,1,1,1,"WWN","£m",1]
["LNA00159","Changed",null,null,null,"WQ","Anglian","Lincolnshire and Northamptonshire","Anglian Water Services Ltd","7AW202055","Navenby STW","Brant - Lower","GB105030056770","River","Witham Upper",null,null,null,"WFD_IMPg","Phosphorus",null,null,null,null,"Continuous Discharge","2024-12-22","Amber","ANNNF2081",498110,357740,null,null,null,null,null,null,null,null,null,null,null,null,null,null,null,null,null,null,null,null,null,null,null,null,null,null,null,null,null,null,2749,null,"1mg/l (AA)","Total Iron= 4mg/l (95%ile) 8mg/l (MAC)",460,null,null,null,null,null,"",null,null,null,null,null,null,null,null,null,null,null,null,null,null,6.87,null,null,null,null,null,null,"Part of cost beneficial bundle for catchment",null,null,0.09,1,1,1,"WWN","£m",1]
["LNA00160","Changed",null,null,null,"WQ","Anglian","Lincolnshire and Northamptonshire","Anglian Water Services Ltd","7AW202056","Nettleham STW","Nettleham Beck","GB105030062210","River","Witham Lower",null,null,null,"WFD_IMPg","Phosphorus",null,null,null,null,"Continuous Discharge","2024-12-22","Amber","ANNNF13387",501920,375880,null,null,null,null,null,null,null,null,null,null,null,null,null,null,null,null,null,null,null,null,null,null,null,null,null,null,null,null,null,null,4587,null,"0.3mg/l (AA)","Total Iron= 4mg/l (95%ile) 8mg/l (MAC)",1142,null,null,null,null,null,"",null,null,null,null,null,null,null,null,null,null,null,null,null,null,2.73,null,null,null,null,null,null,"Part of cost beneficial bundle for catchment",null,null,3.048,1,1,1,"WWN","£m",1]
["LNA00165","Changed",null,null,null,"WQ","Anglian","Lincolnshire and Northamptonshire","Anglian Water Services Ltd","7AW202061","Osbournby STW","South Beck","GB105030056520","River","South Forty Foot Drain",null,null,null,"WFD_IMPg","Phosphorus",null,null,null,null,"Continuous Discharge","2024-12-22","Amber","ANNNF1161",507580,338220,null,null,null,null,null,null,null,null,null,null,null,null,null,null,null,null,null,null,null,null,null,null,null,null,null,null,null,null,null,null,616,null,"0.5mg/l (AA)","Total Iron= 4mg/l (95%ile) 8mg/l (MAC)",130,null,null,null,null,null,"",null,null,null,null,null,null,null,null,null,null,null,null,null,null,8.67,null,null,null,null,null,null,"Part of cost beneficial bundle for catchment",null,null,1.85,1,1,1,"WWN","£m",1]
["LNA00167","Changed",null,null,null,"WQ","Anglian","Lincolnshire and Northamptonshire","Anglian Water Services Ltd","7AW202063","Reepham (Lincs) STW","Barlings Eau","GB105030062290","River","Witham Lower",null,null,null,"WFD_IMPg","Phosphorus",null,null,null,null,"Continuous Discharge","2024-12-22","Amber","ANNNF2084",504290,374800,null,null,null,null,null,null,null,null,null,null,null,null,null,null,null,null,null,null,null,null,null,null,null,null,null,null,null,null,null,null,7630,null,"0.25mg/l (AA)","Total Iron= 4mg/l (95%ile) 8mg/l (MAC)",1920,null,null,null,null,null,"",null,null,null,null,null,null,null,null,null,null,null,null,null,null,5.08,null,null,null,null,null,null,"Part of cost beneficial bundle for catchment",null,null,4.2850000000000001,1,1,1,"WWN","£m",1]
["LNA00172","Changed",null,null,null,"WQ","Anglian","Lincolnshire and Northamptonshire","Anglian Water Services Ltd","7AW202068","Silk Willoughby STW","Cliff Beck","GB105030056630","River","South Forty Foot Drain",null,null,null,"WFD_IMPg","Phosphorus",null,null,null,null,"Continuous Discharge","2024-12-22","Amber","AW3NF265",505950,342950,null,null,null,null,null,null,null,null,null,null,null,null,null,null,null,null,null,null,null,null,null,null,null,null,null,null,null,null,null,null,267,null,"1mg/l (AA)","Total Iron= 4mg/l (95%ile) 8mg/l (MAC)",47,null,null,null,null,null,"",null,null,null,null,null,null,null,null,null,null,null,null,null,null,6.53,null,null,null,null,null,null,"Part of cost beneficial bundle for catchment",null,null,1.5780000000000001,1,1,1,"WWN","£m",1]
["LNA00178","Changed",null,null,null,"WQ","Anglian","Lincolnshire and Northamptonshire","Anglian Water Services Ltd","7AW202074","South Witham STW","Witham - Headwaters to conf Cringle BK","GB105030051570","River","Witham Upper",null,null,null,"WFD_IMPg","Phosphorus",null,null,null,null,"Continuous Discharge","2024-12-22","Amber","AW3NF149",492900,319700,null,null,null,null,null,null,null,null,null,null,null,null,null,null,null,null,null,null,null,null,null,null,null,null,null,null,null,null,null,null,1810,null,"0.3mg/l (AA)","Total Iron= 4mg/l (95%ile) 8mg/l (MAC)",285,null,null,null,null,null,"",null,null,null,null,null,null,null,null,null,null,null,null,null,null,8.42,null,null,null,null,null,null,"Part of cost beneficial bundle for catchment",null,null,3.3940000000000001,1,1,1,"WWN","£m",1]
["LNA00182","Changed",null,null,null,"WQ","Anglian","Lincolnshire and Northamptonshire","Anglian Water Services Ltd","7AW202078","Strubby STW","Woldgrift Drain","GB105029061750","River","Steeping and Eaus",null,null,null,"WFD_IMPg","Phosphorus",null,null,null,null,"Continuous Discharge","2024-12-22","Amber","ANNNF13333",544730,379070,null,null,null,null,null,null,null,null,null,null,null,null,null,null,null,null,null,null,null,null,null,null,null,null,null,null,null,null,null,null,681,null,"0.6mg/l (AA)","Total Iron= 4mg/l (95%ile) 8mg/l (MAC)",145,null,null,null,null,null,"",null,null,null,null,null,null,null,null,null,null,null,null,null,null,3.62,null,null,null,null,null,null,"Part of cost beneficial bundle for catchment",null,null,2.4380000000000002,1,1,1,"WWN","£m",1]
["LNA00189","Changed",null,null,null,"WQ","Anglian","Lincolnshire and Northamptonshire","Anglian Water Services Ltd","7AW202085","Toynton St Peter STW","Maud Foster and Fen catchwater drains","GB205030056465","River","Fens East and West",null,null,null,"WFD_IMPg","Phosphorus",null,null,null,null,"Continuous Discharge","2024-12-22","Amber","ANNNF13779",540280,362840,null,null,null,null,null,null,null,null,null,null,null,null,null,null,null,null,null,null,null,null,null,null,null,null,null,null,null,null,null,null,505,null,"1mg/l (AA)","Total Iron= 4mg/l (95%ile) 8mg/l (MAC)",49,null,null,null,null,null,"",null,null,null,null,null,null,null,null,null,null,null,null,null,null,8.26,null,null,null,null,null,null,"Part of Cost Beneficial Bundle for operational catchment",null,null,1.5780000000000001,1,1,1,"WWN","£m",1]
["LNA00190","Changed",null,null,null,"WQ","Anglian","Lincolnshire and Northamptonshire","Anglian Water Services Ltd","7AW202086","Upton STW","Till (Witham)","GB105030062500","River","Witham Upper",null,null,null,"WFD_IMPg","Phosphorus",null,null,null,null,"Continuous Discharge","2024-12-22","Amber","AW3NF153",487700,386800,null,null,null,null,null,null,null,null,null,null,null,null,null,null,null,null,null,null,null,null,null,null,null,null,null,null,null,null,null,null,1060,null,"1mg/l (AA)","Total Iron= 4mg/l (95%ile) 8mg/l (MAC)",210,null,null,null,null,null,"",null,null,null,null,null,null,null,null,null,null,null,null,null,null,5.54,null,null,null,null,null,null,"Part of cost beneficial bundle for catchment",null,null,0.22500000000000001,1,1,1,"WWN","£m",1]
["LNA00193","Changed",null,null,null,"WQ","Anglian","Lincolnshire and Northamptonshire","Anglian Water Services Ltd","7AW202089","Willingham (Lincs) STW","Till (Witham)","GB105030062500","River","Witham Upper",null,null,null,"WFD_IMPg","Phosphorus",null,null,null,null,"Continuous Discharge","2024-12-22","Amber","ANNNF1407",487950,384490,null,null,null,null,null,null,null,null,null,null,null,null,null,null,null,null,null,null,null,null,null,null,null,null,null,null,null,null,null,null,537,null,"1mg/l (AA)","Total Iron= 4mg/l (95%ile) 8mg/l (MAC)",120,null,null,null,null,null,"",null,null,null,null,null,null,null,null,null,null,null,null,null,null,2.93,null,null,null,null,null,null,"Part of cost beneficial bundle for operational catchment",null,null,0.52100000000000002,1,1,1,"WWN","£m",1]
["LNA00195","Changed",null,null,null,"WQ","Anglian","Lincolnshire and Northamptonshire","Anglian Water Services Ltd","7AW202091","Wragby STW","Goltho Beck","GB105030062250","River","Witham Lower",null,null,null,"WFD_IMPg","Phosphorus",null,null,null,null,"Continuous Discharge","2024-12-22","Amber","AW3NF155",512500,378000,null,null,null,null,null,null,null,null,null,null,null,null,null,null,null,null,null,null,null,null,null,null,null,null,null,null,null,null,null,null,2094,null,"0.25mg/l (AA)","Total Iron= 4mg/l (95%ile) 8mg/l (MAC)",537,null,null,null,null,null,"",null,null,null,null,null,null,null,null,null,null,null,null,null,null,6.88,null,null,null,null,null,null,"If permit limit needed is below TAL",null,null,3.3380000000000001,1,1,1,"WWN","£m",1]
["LNA00207","Changed",null,null,null,"WQ","Anglian","Lincolnshire and Northamptonshire","Anglian Water Services Ltd","7AW202103","Gosberton STW","Risegate Eau","GB205031055525","River","Welland Lower",null,null,null,"WFD_IMPg","Phosphorus",null,null,null,null,"Continuous Discharge","2024-12-22","Amber","AW5NF513",522660,332260,null,null,null,null,null,null,null,null,null,null,null,null,null,null,null,null,null,null,null,null,null,null,null,null,null,null,null,null,null,null,2290,null,"0.9mg/l (AA)","Total Iron=3mg/l (95%ile) 8mg/l (MAC)",400,null,null,null,null,null,"",null,null,null,null,null,null,null,null,null,null,null,null,null,null,4.2699999999999996,null,null,null,null,null,null,"Part of cost beneficial bundle for operational catchment",null,null,2.2909999999999999,1,1,1,"WWN","£m",1]
["LNA00211","Changed",null,null,null,"WQ","Anglian","Lincolnshire and Northamptonshire","Anglian Water Services Ltd","7AW202107","Holbeach STW","Whaplode River","GB205031055495","River","Welland Lower",null,null,null,"WFD_IMPm","Phosphorus",null,null,null,null,"Continuous Discharge","2024-12-22","Amber","AW5NF378A",535750,326030,null,null,null,null,null,null,null,null,null,null,null,null,null,null,null,null,null,null,null,null,null,null,null,null,null,null,null,null,null,null,8011,null,"0.25mg/l (AA)","Total Iron= 3mg/l (95%ile) 8mg/l (MAC)",1910,null,null,null,null,null,"",null,null,null,null,null,null,null,null,null,null,null,null,null,null,8.2200000000000006,null,null,null,null,null,null,"Permit limit need for good is beyond TAL. Part of cost beneficial bundle for operational catchment"]
["LNA00215","Changed",null,null,null,"WQ","Anglian","Lincolnshire and Northamptonshire","Anglian Water Services Ltd","7AW202111","Kibworth STW","Langton Brook","GB105031045620","River","Welland Upper",null,null,null,"WFD_IMPm","Phosphorus","SSSI_IMP",null,null,null,"Continuous Discharge","2024-12-22","Amber","AW5NF803",468980,292660,null,null,null,null,"RUTLAND WATER","Rutland Water (SPA)","SSSI Unit ID - 029, 030 and 031, Ramsar ID UK11062",1212,"New targets required to meet conservation objective standards since PR14 (CSMG)",null,null,null,null,null,null,null,null,null,null,null,null,null,null,null,null,null,null,null,null,null,5161,null,"0.25mg/l (AA)","Total Iron= 3mg/l (95%ile) 8mg/l (MAC)",1700,null,null,null,null,null,"",null,null,null,null,null,null,null,null,null,null,null,null,null,null,8.7100000000000009,null,null,63.8,null,null,null,"Permit required for good status is beyond TAL. Part of cost beneficial bundle for operational catchment. Environmental outcomes include improvement to river and SSSI"]
["LNA00217","Changed",null,null,null,"WQ","Anglian","Lincolnshire and Northamptonshire","Anglian Water Services Ltd","7AW202113","Little Bytham STW","The Tham","GB105031050650","River","Glens",null,null,null,"WFD_IMPg","Phosphorus",null,null,null,null,"Continuous Discharge","2024-12-22","Amber","AWNNF13357",500730,318060,null,null,null,null,null,null,null,null,null,null,null,null,null,null,null,null,null,null,null,null,null,null,null,null,null,null,null,null,null,null,1993,null,"0.3mg/l (AA)","Total Iron= 4mg/l (95%ile) 8mg/l (MAC)",800,null,null,null,null,null,"",null,null,null,null,null,null,null,null,null,null,null,null,null,null,17.7,null,null,null,null,null,null,"Part of cost beneficial bundle for operational catchment",null,null,2.8809999999999998,1,1,1,"WWN","£m",1]
["LNA00219","Changed",null,null,null,"WQ","Anglian","Lincolnshire and Northamptonshire","Anglian Water Services Ltd","7AW202115","Market Harborough STW","Welland - conf Jordan to conf langton bk","GB105031045610","River","Welland Upper",null,null,null,"WFD_IMPm","Phosphorus","SSSI_IMP",null,null,null,"Continuous Discharge","2024-12-22","Amber","AW5NF739A",475880,288840,null,null,null,null,"RUTLAND WATER","Rutland Water (SPA)","SSSI Unit ID – 029, 030 and 031, Ramsar ID UK11062",1212,"New targets required to meet conservation objective standards since PR14 (CSMG)",null,null,null,null,null,null,null,null,null,null,null,null,null,null,null,null,null,null,null,null,null,23648,"2","0.25mg/l (AA)","Total Iron= 4mg/l (95%ile) 8mg/l (MAC)",6025,null,null,null,null,null,"",null,null,null,null,null,null,null,null,null,null,null,null,null,null,7.1,null,null,63.8,null,null,null,"Permit required for good status is beyond TAL. Part of cost beneficial bundle for operational catchment. Environmental outcomes include improvement to river and SSSI"]
["LNA00229","Changed",null,null,null,"WQ","Anglian","Lincolnshire and Northamptonshire","Anglian Water Services Ltd","7AW202125","Sibbertoft STW","Welland - headwaters to conf Jordan","GB105031045630","River","Welland Upper",null,null,null,"WFD_IMPg","Phosphorus","SSSI_IMP",null,null,null,"Continuous Discharge","2024-12-22","Amber","AW5NF761",467290,283020,null,null,null,null,"RUTLAND WATER","Rutland Water (SPA)","SSSI Unit ID - 029, 030 and 031, Ramsar ID UK11062",1212,"New targets required to meet conservation objective standards since PR14 (CSMG)",null,null,null,null,null,null,null,null,null,null,null,null,null,null,null,null,null,null,null,null,null,361,null,"0.25mg/l (AA)","Total Iron= 4mg/l (95%ile) 8mg/l (MAC)",79,null,null,null,null,null,"",null,null,null,null,null,null,null,null,null,null,null,null,null,null,15.4,null,null,63.8,null,null,null,"Part of cost beneficial bundle for operational catchment. Environmental outcomes include improvement to river and SSSI",null,null,2.9140000000000001,1,1,1,"WWN","£m",1]
["LNA00239","Changed",null,null,null,"WQ","Anglian","Lincolnshire and Northamptonshire","Anglian Water Services Ltd","7AW202135","Wing STW","Chater - Upper","GB105031050430","River","Welland Upper",null,null,null,"WFD_IMPg","Phosphorus","SSSI_IMP",null,null,null,"Continuous Discharge","2024-12-22","Amber","AW5NF764",489030,303530,null,null,null,null,"RUTLAND WATER","Rutland Water (SPA)","SSSI Unit ID - 029, 030 and 031, Ramsar ID UK11062",1212,"New targets required to meet conservation objective standards since PR14 (CSMG)",null,null,null,null,null,null,null,null,null,null,null,null,null,null,null,null,null,null,null,null,null,540,null,"1mg/l (AA)","Total Iron: 4mg/l (95%ile) 8mg/l (MAC)",0,null,null,null,null,null,"",null,null,null,null,null,null,null,null,null,null,null,null,null,null,6.86,null,null,63.8,null,null,null,"Part of cost beneficial bundle for operational catchment. Environmental outcomes include improvement to river and SSSI",null,null,1.248,1,1,1,"WWN","£m",1]
["LNA00243","Changed",null,null,null,"WQ","Humber","Lincolnshire and Northamptonshire","Anglian Water Services Ltd","7AW202139","Caistor STW","Caistor canal catchment (trib of Ancholme)","GB104029061920","River","Ancholme",null,null,null,"WFD_IMPg","Phosphorus",null,null,null,null,"Continuous Discharge","2024-12-22","Amber","AW3NFF232",510710,401110,null,null,null,null,null,null,null,null,null,null,null,null,null,null,null,null,null,null,null,null,null,null,null,null,null,null,null,null,null,null,3832,null,"0.25mg/l (AA)","Total Iron= 4mg/l (95%ile) 8mg/l (MAC)",800,null,null,null,null,null,"",null,null,null,null,null,null,null,null,null,null,null,null,null,null,10.4,null,null,null,null,null,null,"Part of cost beneficial bundle for operational catchment",null,null,3.1429999999999998,1,1,1,"WWN","£m",1]
["LNA00244","Changed",null,null,null,"WQ","Humber","Lincolnshire and Northamptonshire","Anglian Water Services Ltd","7AW202140","Faldingworth (Ex MOD) STW","Ancholme from source to Bishopbridge","GB104029061850","River","Ancholme",null,null,null,"WFD_IMPg","Phosphorus",null,null,null,null,"Continuous Discharge","2024-12-22","Amber","AW3NFF1295",504000,387200,null,null,null,null,null,null,null,null,null,null,null,null,null,null,null,null,null,null,null,null,null,null,null,null,null,null,null,null,null,null,343,null,"1mg/l (AA)","Total Iron: 4mg/l (95%ile) 8mg/l (MAC)",100,null,null,null,null,null,"",null,null,null,null,null,null,null,null,null,null,null,null,null,null,2.0299999999999998,null,null,null,null,null,null,"Part of cost beneficial bundle for operational catchment",null,null,1.583,1,1,1,"WWN","£m",1]
["LNA00245","Changed",null,null,null,"WQ","Humber","Lincolnshire and Northamptonshire","Anglian Water Services Ltd","7AW202141","Glentham STW","Ancholme from Bishopbridge to the Humber","GB104029067520","River","Ancholme",null,null,null,"WFD_IMPg","Phosphorus",null,null,null,null,"Continuous Discharge","2024-12-22","Amber","AW3NFF957",500350,390750,null,null,null,null,null,null,null,null,null,null,null,null,null,null,null,null,null,null,null,null,null,null,null,null,null,null,null,null,null,null,1263,null,"0.8mg/l (AA)","Total Iron= 4mg/l (95%ile) 8mg/l (MAC)",251,null,null,null,null,null,"",null,null,null,null,null,null,null,null,null,null,null,null,null,null,2.65,null,null,null,null,null,null,"Part of cost beneficial bundle for operational catchment",null,null,0.65100000000000002,1,1,1,"WWN","£m",1]
["LNA00249","Changed",null,null,null,"WQ","Humber","Lincolnshire and Northamptonshire","Anglian Water Services Ltd","7AW202145","Laceby STW","Laceby Beck / River Freshney Catchment (to N Sea)","GB104029067530","River","Becks Northern",null,null,null,"WFD_IMPg","Phosphorus",null,null,null,null,"Continuous Discharge","2024-12-22","Amber","ANNNF1490",522090,407150,null,null,null,null,null,null,null,null,null,null,null,null,null,null,null,null,null,null,null,null,null,null,null,null,null,null,null,null,null,null,3423,null,"0.25mg/l (AA)","Total Iron= 4mg/l (95%ile) 8mg/l (MAC)",732,null,null,null,null,null,"",null,null,null,null,null,null,null,null,null,null,null,null,null,null,9.76,null,null,null,null,null,null,"Part of cost beneficial bundle for operatoinal catchment",null,null,3.1230000000000002,1,1,1,"WWN","£m",1]
["LNA00250","Changed",null,null,null,"WQ","Humber","Lincolnshire and Northamptonshire","Anglian Water Services Ltd","7AW202146","Louth STW","Louth Canal","GB104029061990","River","Becks Northern",null,null,null,"WFD_IMPg","Phosphorus",null,null,null,null,"Continuous Discharge","2024-12-22","Amber","ANNNF1131",535900,390300,null,null,null,null,null,null,null,null,null,null,null,null,null,null,null,null,null,null,null,null,null,null,null,null,null,null,null,null,null,null,20113,"2","0.3mg/l (AA)","Total Iron= 4mg/l (95%ile) 8mg/l (MAC)",6000,null,null,null,null,null,"",null,null,null,null,null,null,null,null,null,null,null,null,null,null,14.3,null,null,null,null,null,null,"Part of cost beneficial bundle for operatoinal catchment",null,null,6.34,1,1,1,"WWN","£m",1]
["LNA00251","Changed",null,null,null,"WQ","Humber","Lincolnshire and Northamptonshire","Anglian Water Services Ltd","7AW202147","Market Rasen STW","Rase from Market Rasen to Bishopbridge","GB104029061870","River","Ancholme",null,null,null,"WFD_IMPg","Phosphorus",null,null,null,null,"Continuous Discharge","2024-12-22","Amber","AW3NF89",507451,389029,null,null,null,null,null,null,null,null,null,null,null,null,null,null,null,null,null,null,null,null,null,null,null,null,null,null,null,null,null,null,6108,null,"0.4mg/l (AA)","Total Iron= 4mg/l (95%ile) 8mg/l (MAC)",1600,null,null,null,null,null,"",null,null,null,null,null,null,null,null,null,null,null,null,null,null,10.5,null,null,null,null,null,null,"Part of cost beneficial bundle for operational catchment",null,null,2.2330000000000001,1,1,1,"WWN","£m",1]
["LNA00254","Changed",null,null,null,"WQ","Humber","Lincolnshire and Northamptonshire","Anglian Water Services Ltd","7AW202150","Owmby STW","Ancholme from source to Bishopbridge","GB104029061850","River","Ancholme",null,null,null,"WFD_IMPg","Phosphorus",null,null,null,null,"Continuous Discharge","2024-12-22","Amber","AW3NF288",500450,387300,null,null,null,null,null,null,null,null,null,null,null,null,null,null,null,null,null,null,null,null,null,null,null,null,null,null,null,null,null,null,480,null,"1mg/l (AA)","Total Iron= 4mg/l (95%ile) 8mg/l (MAC)",116,null,null,null,null,null,"",null,null,null,null,null,null,null,null,null,null,null,null,null,null,3.08,null,null,null,null,null,null,"Part of cost beneficial bundle for operational catchment",null,null,0.22500000000000001,1,1,1,"WWN","£m",1]
["LNA00255","Changed",null,null,null,"WQ","Humber","Lincolnshire and Northamptonshire","Anglian Water Services Ltd","7AW202151","Tealby STW","Rase from source to Market Rasen","GB104029062130","River","Ancholme",null,null,null,"WFD_IMPg","Phosphorus",null,null,null,null,"Continuous Discharge","2024-12-22","Amber","ANNNF13409",515200,390350,null,null,null,null,null,null,null,null,null,null,null,null,null,null,null,null,null,null,null,null,null,null,null,null,null,null,null,null,null,null,895,null,"0.8mg/l (AA)","Total Iron= 4mg/l (95%ile) 8mg/l (MAC)",179,null,null,null,null,null,"",null,null,null,null,null,null,null,null,null,null,null,null,null,null,9.7100000000000009,null,null,null,null,null,null,"Part of cost beneficial bundle for operational catchment",null,null,1.347,1,1,1,"WWN","£m",1]
["LNA00256","Changed",null,null,null,"WQ","Humber","Lincolnshire and Northamptonshire","Anglian Water Services Ltd","7AW202152","Ulceby STW","Skitter Beck / East Halton Beck","GB104029067655","River","Becks Northern",null,null,null,"WFD_IMPg","Phosphorus",null,null,null,null,"Continuous Discharge","2024-12-22","Amber","ANNNF13085",511150,416540,null,null,null,null,null,null,null,null,null,null,null,null,null,null,null,null,null,null,null,null,null,null,null,null,null,null,null,null,null,null,2086,null,"0.25mg/l (AA)","Total Iron= 4mg/l (95%ile) 8mg/l (MAC)",370,null,null,null,null,null,"",null,null,null,null,null,null,null,null,null,null,null,null,null,null,7.58,null,null,null,null,null,null,"Part of cost beneficial bundle for operational catchment",null,null,2.9460000000000002,1,1,1,"WWN","£m",1]
["LNA00263","Changed",null,null,null,"WQ","Anglian","Lincolnshire and Northamptonshire","Anglian Water Services Ltd","7AW202159","Corby Glen STW","West Glen - Upper","GB105031055510","River","Glens",null,null,null,"WFD_IMPg","Biochemical Oxygen Demand / Dissolved Oxygen",null,null,null,null,"Continuous Discharge","2024-12-22","Amber","AW5NF300",499400,324640,null,null,null,null,null,null,null,null,null,null,null,null,null,null,null,null,null,null,null,null,null,null,null,null,null,null,null,null,null,null,959,12,"5mg/l",null,150,null,null,null,null,null,"",null,null,null,null,null,null,null,null,null,null,null,null,null,null,9.7899999999999991,null,null,null,null,null,null,"Part of cost beneficial bundle for operational catchment",null,null,1.8440000000000001,1,1,1,"WWN","£m",1]
["LNA00273","Changed",null,null,null,"WQ","Anglian","Lincolnshire and Northamptonshire","Anglian Water Services Ltd","7AW202169","DrWPA - Aswarby","Witham Limestone Unit A","GB40501G444800","Groundwater","Witham Limestone Unit A",null,null,null,"DrWPA_IMP","Nitrate",null,null,null,null,"Catchment Measure","2025-03-31","Amber","4/30/12/*G/0205",506700,339150,null,null,"Interventions not modelled to have a significant impact on overall flat trends but could control large spikes. Programme of engagement to make contact with land managers in the catchment with a view to raising awareness, sharing information and providing advice on best practice. The aim being to improve understanding of future risk, and maintain and ultimately improve water quality and reduce treatment need.",null,null,null,null,null,null,null,null,null,null,null,null,null,null,null,null,null,null,null,null,null,null,"Nitrate as NO3","No","Nitrate",null,null,null,null,null,null,null,null,null,"Interventions not modelled to have a significant impact on overall flat trends but could control large spikes. Programme of engagement to make contact with land managers in the catchment with a view to raising awareness, sharing information and providing advice on best practice. The aim being to improve understanding of future risk, and maintain and ultimately improve water quality and reduce treatment need.",null,null,"",null,null,null,null,null,null,null,null,null,null,null,null,null,null,null,null,1302.8,null,null,null,null,"Note - in CAMS this abstraction was assigned to GWBID GB40501G445100. This is Witham Limestone Unit B, which is considered alongside Unit A as a single GWB. This was therefore used in the spreadsheet for calculating Environmental Outcomes. CAMS has since been corrected so that Aswarby is assigned to GWBID GB40501G444800.",null,null,3.1E-2,1,1,1,"WWN","£m",1]
["LNA00274","Changed",null,null,null,"WQ","Humber","Lincolnshire and Northamptonshire","Anglian Water Services Ltd","7AW202170","DrWPA - Barnoldby","Grimsby Ancholme Louth Chalk Unit","GB40401G401500","Groundwater","Grimsby Ancholme Louth Chalk Unit",null,null,null,"DrWPA_IMP","Nitrate",null,null,null,null,"Catchment Measure","2025-03-31","Amber","4/29/10/*G/0005",524450,403780,null,null,"Interventions modelled to have impact on reducing nitrate concentrations only in the long term. Programme of engagement to make contact with land managers in the catchment with a view to raising awareness, sharing information and providing advice on best practice. The aim being to improve understanding of future risk, maintain and ultimately improve water quality and reduce treatment need.",null,null,null,null,null,null,null,null,null,null,null,null,null,null,null,null,null,null,null,null,null,null,"Nitrate as NO3","No","Nitrate","Barnoldby","GWSGZ0282",null,null,null,null,null,null,null,"Interventions modelled to have impact on reducing nitrate concentrations only in the long term. Programme of engagement to make contact with land managers in the catchment with a view to raising awareness, sharing information and providing advice on best practice. The aim being to improve understanding of future risk, maintain and ultimately improve water quality and reduce treatment need.",null,null,"",null,null,null,null,null,null,null,null,null,null,null,null,null,null,null,null,1122.2,null,null,null,null,"Nitrate treatment but future use subject to Sustainability Reduction outcomes",39592,null,3.1E-2,1,1,1,"WWN","£m",1]
["LNA00275","Changed",null,null,null,"WQ","Humber","Lincolnshire and Northamptonshire","Anglian Water Services Ltd","7AW202171","DrWPA - Barrow","Grimsby Ancholme Louth Chalk Unit","GB40401G401500","Groundwater","Grimsby Ancholme Louth Chalk Unit",null,null,null,"DrWPA_IMP","Nitrate",null,null,null,null,"Catchment Measure","2025-03-31","Amber","4/29/09/*G/0042",506010,420280,null,null,"Modelling suggests interventions will have impact in the medium term. Programme of engagement to make contact with land managers in the catchment with a view to raising awareness, sharing information and providing advice on best practice. The aim being to improve understanding of future risk, and maintain and ultimately improve water quality and reduce treatment need. Activities to be targeted in Safeguard Zones based on trials and options appraisal undertaken in AMP6. ",null,null,null,null,null,null,null,null,null,null,null,null,null,null,null,null,null,null,null,null,null,null,"Nitrate as NO3","No","Nitrate","Barrow","GWSGZ0013",null,null,null,null,null,null,null,"Modelling suggests interventions will have impact in the medium term. Programme of engagement to make contact with land managers in the catchment with a view to raising awareness, sharing information and providing advice on best practice. The aim being to improve understanding of future risk, and maintain and ultimately improve water quality and reduce treatment need. Activities to be targeted in Safeguard Zones based on trials and options appraisal undertaken in AMP6. ",null,null,"",null,null,null,null,null,null,null,null,null,null,null,null,null,null,null,null,3992,null,null,null,null,null,39591,null,3.1E-2,1,1,1,"WWN","£m",1]
["LNA00276","Changed",null,null,null,"WQ","Humber","Lincolnshire and Northamptonshire","Anglian Water Services Ltd","7AW202172","DrWPA - Barton","Grimsby Ancholme Louth Chalk Unit","GB40401G401500","Groundwater","Grimsby Ancholme Louth Chalk Unit",null,null,null,"DrWPA_IMP","Nitrate",null,null,null,null,"Catchment Measure","2025-03-31","Amber","4/29/09/*G/0043",503810,421090,null,null,"Modelling suggests interventions will have impact in the medium term. Programme of engagement to make contact with land managers in the catchment with a view to raising awareness, sharing information and providing advice on best practice. The aim being to improve understanding of future risk, and maintain and ultimately improve water quality and reduce treatment need. Activities to be targeted in Safeguard Zones based on trials and options appraisal undertaken in AMP6. ",null,null,null,null,null,null,null,null,null,null,null,null,null,null,null,null,null,null,null,null,null,null,"Nitrate as NO3","No","Nitrate","Barton","GWSGZ0014",null,null,null,null,null,null,null,"Modelling suggests interventions will have impact in the medium term. Programme of engagement to make contact with land managers in the catchment with a view to raising awareness, sharing information and providing advice on best practice. The aim being to improve understanding of future risk, and maintain and ultimately improve water quality and reduce treatment need. Activities to be targeted in Safeguard Zones based on trials and options appraisal undertaken in AMP6. ",null,null,"",null,null,null,null,null,null,null,null,null,null,null,null,null,null,null,null,736.4,null,null,null,null,null,39591,null,3.1E-2,1,1,1,"WWN","£m",1]
["LNA00277","Changed",null,null,null,"WQ","Anglian","Lincolnshire and Northamptonshire","Anglian Water Services Ltd","7AW202173","DrWPA - Drove Lane","Witham Limestone Unit A","GB40501G444800","Groundwater","Witham Limestone Unit A",null,null,null,"DrWPA_IMP","Nitrate",null,null,null,null,"Catchment Measure","2025-03-31","Amber","4/30/11/*G/0037",505460,346230,null,null,"Interventions modelled to have a small impact on overall flat trends and could control large spikes. Programme of engagement to make contact with land managers in the catchment with a view to raising awareness, sharing information and providing advice on best practice. The aim being to improve understanding of future risk, and maintain and ultimately improve water quality and reduce treatment need.",null,null,null,null,null,null,null,null,null,null,null,null,null,null,null,null,null,null,null,null,null,null,"Nitrate as NO3","No","Nitrate",null,null,null,null,null,null,null,null,null,"Interventions modelled to have a small impact on overall flat trends and could control large spikes. Programme of engagement to make contact with land managers in the catchment with a view to raising awareness, sharing information and providing advice on best practice. The aim being to improve understanding of future risk, and maintain and ultimately improve water quality and reduce treatment need.",null,null,"",null,null,null,null,null,null,null,null,null,null,null,null,null,null,null,null,1430.7,null,null,null,null,null,null,null,3.1E-2,1,1,1,"WWN","£m",1]
["LNA00278","Changed",null,null,null,"WQ","Anglian","Lincolnshire and Northamptonshire","Anglian Water Services Ltd","7AW202174","DrWPA - Dunston","Witham Limestone Unit A","GB40501G444800","Groundwater","Witham Limestone Unit A",null,null,null,"DrWPA_IMP","Nitrate",null,null,null,null,"Catchment Measure","2025-03-31","Amber","4/30/09/*G/0039",506300,362500,null,null,"Interventions modelled to have a small impact on overall flat trends and could control large spikes. Programme of engagement to make contact with land managers in the catchment with a view to raising awareness, sharing information and providing advice on best practice. The aim being to improve understanding of future risk, and maintain and ultimately improve water quality and reduce treatment need.",null,null,null,null,null,null,null,null,null,null,null,null,null,null,null,null,null,null,null,null,null,null,"Nitrate as NO3","No","Nitrate",null,null,null,null,null,null,null,null,null,"Interventions modelled to have a small impact on overall flat trends and could control large spikes. Programme of engagement to make contact with land managers in the catchment with a view to raising awareness, sharing information and providing advice on best practice. The aim being to improve understanding of future risk, and maintain and ultimately improve water quality and reduce treatment need.",null,null,"",null,null,null,null,null,null,null,null,null,null,null,null,null,null,null,null,716.9,null,null,null,null,null,null,null,3.1E-2,1,1,1,"WWN","£m",1]
["LNA00279","Changed",null,null,null,"WQ","Anglian","Lincolnshire and Northamptonshire","Anglian Water Services Ltd","7AW202175","Etton","Welland Limestone Unit A","GB40501G445900","Groundwater","Welland Limestone Unit A",null,null,null,"WFDGW_IMP_GWQ","Contaminated Land Remediation",null,null,null,null,"Adaptive Management","2024-12-22","Amber","5/31/13/*G/0034",514150,305090,null,null,"Modelling completed for Helpston project and on-site solution of source-removal (excavation/treatment/replacement) already trialled, appraised, costed and approved. Delivery pending funding. Historic landfill point source of mecoprop, metaldehyde and ammonia to be targeted for source removal works to accelerate long-term remediation project at Helpston. Only beneficial to AWS if EA close treatment facility and cease hydraulic control around Helpston.",null,null,null,null,null,null,null,null,null,null,null,null,null,null,null,null,null,null,null,null,null,null,"Mecoprop","Yes","Mecoprop, ammonia, metaldehyde",null,null,null,null,null,null,null,null,null,"Modelling completed for Helpston project and on-site solution of source-removal (excavation/treatment/replacement) already trialled, appraised, costed and approved. Delivery pending funding. Historic landfill point source of mecoprop, metaldehyde and ammonia to be targeted for source removal works to accelerate long-term remediation project at Helpston. Only beneficial to AWS if EA close treatment facility and cease hydraulic control around Helpston.",null,null,"",null,null,null,null,null,null,null,null,null,null,null,null,null,null,null,null,1093.7,null,null,null,null,"Source removal solution at Ailsworth Road landfill - excavate waste mass, bioremediate through windrowing and replace when suitable for use. No permit limits added in columns BF - BK as the Etton discharge (for treatment waste, not STW) does not relate to the proposed measure to be funded. Cost beneficial but Amber as waiting for RBMP3 approval for affordability.",25558,null,4.2480000000000002,1,1,1,"WWN","£m",1]
["LNA00280","Changed",null,null,null,"WQ","Humber","Lincolnshire and Northamptonshire","Anglian Water Services Ltd","7AW202176","DrWPA - Goxhill 2","Grimsby Ancholme Louth Chalk Unit","GB40401G401500","Groundwater","Grimsby Ancholme Louth Chalk Unit",null,null,null,"DrWPA_IMP","Nitrate",null,null,null,null,"Catchment Measure","2025-03-31","Amber","4/29/09/*G/0118",509500,419940,null,null,"Modelling suggests interventions will have impact in the medium term. Programme of engagement to make contact with land managers in the catchment with a view to raising awareness, sharing information and providing advice on best practice. The aim being to improve understanding of future risk, and maintain and ultimately improve water quality and reduce treatment need. Activities to be targeted in Safeguard Zones based on trials and options appraisal undertaken in AMP6. ",null,null,null,null,null,null,null,null,null,null,null,null,null,null,null,null,null,null,null,null,null,null,"Nitrate as NO3","No","Nitrate","Goxhill","GWSGZ0400",null,null,null,null,null,null,null,"Modelling suggests interventions will have impact in the medium term. Programme of engagement to make contact with land managers in the catchment with a view to raising awareness, sharing information and providing advice on best practice. The aim being to improve understanding of future risk, and maintain and ultimately improve water quality and reduce treatment need. Activities to be targeted in Safeguard Zones based on trials and options appraisal undertaken in AMP6. ",null,null,"",null,null,null,null,null,null,null,null,null,null,null,null,null,null,null,null,363.5,null,null,null,null,null,39591,null,3.1E-2,1,1,1,"WWN","£m",1]
["LNA00281","Changed",null,null,null,"WQ","Humber","Lincolnshire and Northamptonshire","Anglian Water Services Ltd","7AW202177","DrWPA - Habrough","Grimsby Ancholme Louth Chalk Unit","GB40401G401500","Groundwater","Grimsby Ancholme Louth Chalk Unit",null,null,null,"DrWPA_IMP","Nitrate",null,null,null,null,"Catchment Measure","2025-03-31","Amber","4/29/09/*G/0001",514030,413520,null,null,"Interventions modelled to have impact on reducing nitrate concentrations only in the long term. Programme of engagement to make contact with land managers in the catchment with a view to raising awareness, sharing information and providing advice on best practice. The aim being to improve understanding of future risk, maintain and ultimately improve water quality and reduce treatment need.",null,null,null,null,null,null,null,null,null,null,null,null,null,null,null,null,null,null,null,null,null,null,"Nitrate as NO3","No","Nitrate","Habrough","GWSGZ0281",null,null,null,null,null,null,null,"Interventions modelled to have impact on reducing nitrate concentrations only in the long term. Programme of engagement to make contact with land managers in the catchment with a view to raising awareness, sharing information and providing advice on best practice. The aim being to improve understanding of future risk, maintain and ultimately improve water quality and reduce treatment need.",null,null,"",null,null,null,null,null,null,null,null,null,null,null,null,null,null,null,null,3548.4,null,null,null,null,"Feeds into Irby WTW",39592,null,3.1E-2,1,1,1,"WWN","£m",1]
["LNA00282","Changed",null,null,null,"WQ","Humber","Lincolnshire and Northamptonshire","Anglian Water Services Ltd","7AW202178","DrWPA - Healing","Grimsby Ancholme Louth Chalk Unit","GB40401G401500","Groundwater","Grimsby Ancholme Louth Chalk Unit",null,null,null,"DrWPA_IMP","Nitrate",null,null,null,null,"Catchment Measure","2025-03-31","Amber","4/29/09/*G/0004",521430,410900,null,null,"Interventions modelled to have impact on reducing nitrate concentrations only in the long term. Programme of engagement to make contact with land managers in the catchment with a view to raising awareness, sharing information and providing advice on best practice. The aim being to improve understanding of future risk, maintain and ultimately improve water quality and reduce treatment need.",null,null,null,null,null,null,null,null,null,null,null,null,null,null,null,null,null,null,null,null,null,null,"Nitrate as NO3","No","Nitrate","Healing","GWSGZ0283",null,null,null,null,null,null,null,"Interventions modelled to have impact on reducing nitrate concentrations only in the long term. Programme of engagement to make contact with land managers in the catchment with a view to raising awareness, sharing information and providing advice on best practice. The aim being to improve understanding of future risk, maintain and ultimately improve water quality and reduce treatment need.",null,null,"",null,null,null,null,null,null,null,null,null,null,null,null,null,null,null,null,3992,null,null,null,null,"Feeds into Irby WTW",39592,null,3.1E-2,1,1,1,"WWN","£m",1]
["LNA00283","Changed",null,null,null,"WQ","Humber","Lincolnshire and Northamptonshire","Anglian Water Services Ltd","7AW202179","DrWPA - Little London","Grimsby Ancholme Louth Chalk Unit","GB40401G401500","Groundwater","Grimsby Ancholme Louth Chalk Unit",null,null,null,"DrWPA_IMP","Nitrate",null,null,null,null,"Catchment Measure","2025-03-31","Amber","4/29/09/*G/0003",518830,411430,null,null,"Interventions modelled to have impact on reducing nitrate concentrations only in the long term. Programme of engagement to make contact with land managers in the catchment with a view to raising awareness, sharing information and providing advice on best practice. The aim being to improve understanding of future risk, maintain and ultimately improve water quality and reduce treatment need.",null,null,null,null,null,null,null,null,null,null,null,null,null,null,null,null,null,null,null,null,null,null,"Nitrate as NO3","No","Nitrate","Little London","GWSGZ0284",null,null,null,null,null,null,null,"Interventions modelled to have impact on reducing nitrate concentrations only in the long term. Programme of engagement to make contact with land managers in the catchment with a view to raising awareness, sharing information and providing advice on best practice. The aim being to improve understanding of future risk, maintain and ultimately improve water quality and reduce treatment need.",null,null,"",null,null,null,null,null,null,null,null,null,null,null,null,null,null,null,null,3548.4,null,null,null,null,"Feeds into Irby WTW",39592,null,3.1E-2,1,1,1,"WWN","£m",1]
["LNA00284","Changed",null,null,null,"WQ","Humber","Lincolnshire and Northamptonshire","Anglian Water Services Ltd","7AW202180","DrWPA - Littlecoates","Grimsby Ancholme Louth Chalk Unit","GB40401G401500","Groundwater","Grimsby Ancholme Louth Chalk Unit",null,null,null,"DrWPA_IMP","Nitrate",null,null,null,null,"Catchment Measure","2025-03-31","Amber","4/29/10/*G/0001",525230,408590,null,null,"Interventions modelled to have impact on reducing nitrate concentrations only in the long term. Programme of engagement to make contact with land managers in the catchment with a view to raising awareness, sharing information and providing advice on best practice. The aim being to improve understanding of future risk, maintain and ultimately improve water quality and reduce treatment need.",null,null,null,null,null,null,null,null,null,null,null,null,null,null,null,null,null,null,null,null,null,null,"Nitrate as NO3","No","Nitrate","Littlecoates","GWSGZ0015",null,null,null,null,null,null,null,"Interventions modelled to have impact on reducing nitrate concentrations only in the long term. Programme of engagement to make contact with land managers in the catchment with a view to raising awareness, sharing information and providing advice on best practice. The aim being to improve understanding of future risk, maintain and ultimately improve water quality and reduce treatment need.",null,null,"",null,null,null,null,null,null,null,null,null,null,null,null,null,null,null,null,5766.2,null,null,null,null,"Feeds into Irby WTW",39592,null,3.1E-2,1,1,1,"WWN","£m",1]
["LNA00285","Changed",null,null,null,"WQ","Humber","Lincolnshire and Northamptonshire","Anglian Water Services Ltd","7AW202181","DrWPA - Thornton Curtis","Grimsby Ancholme Louth Chalk Unit","GB40401G401500","Groundwater","Grimsby Ancholme Louth Chalk Unit",null,null,null,"DrWPA_IMP","Nitrate",null,null,null,null,"Catchment Measure","2025-03-31","Amber","4/29/09/*G/0041",512470,417880,null,null,"Modelling suggests interventions will have impact in the medium term. Programme of engagement to make contact with land managers in the catchment with a view to raising awareness, sharing information and providing advice on best practice. The aim being to improve understanding of future risk, and maintain and ultimately improve water quality and reduce treatment need. Activities to be targeted in Safeguard Zones based on trials and options appraisal undertaken in AMP6. ",null,null,null,null,null,null,null,null,null,null,null,null,null,null,null,null,null,null,null,null,null,null,"Nitrate as NO3","No","Nitrate","Thornton Curtis","GWSGZ0286",null,null,null,null,null,null,null,"Modelling suggests interventions will have impact in the medium term. Programme of engagement to make contact with land managers in the catchment with a view to raising awareness, sharing information and providing advice on best practice. The aim being to improve understanding of future risk, and maintain and ultimately improve water quality and reduce treatment need. Activities to be targeted in Safeguard Zones based on trials and options appraisal undertaken in AMP6. ",null,null,"",null,null,null,null,null,null,null,null,null,null,null,null,null,null,null,null,1978.1,null,null,null,null,null,39591,null,3.1E-2,1,1,1,"WWN","£m",1]
["LNA00286","Changed",null,null,null,"WQ","Humber","Lincolnshire and Northamptonshire","Anglian Water Services Ltd","7AW202182","DrWPA - Ulceby","Grimsby Ancholme Louth Chalk Unit","GB40401G401500","Groundwater","Grimsby Ancholme Louth Chalk Unit",null,null,null,"DrWPA_IMP","Nitrate",null,null,null,null,"Catchment Measure","2025-03-31","Amber","4/29/09/*G/0117",510530,412730,null,null,"Modelling suggests interventions will have impact in the medium term. Programme of engagement to make contact with land managers in the catchment with a view to raising awareness, sharing information and providing advice on best practice. The aim being to improve understanding of future risk, and maintain and ultimately improve water quality and reduce treatment need. Activities to be targeted in Safeguard Zones based on trials and options appraisal undertaken in AMP6. ",null,null,null,null,null,null,null,null,null,null,null,null,null,null,null,null,null,null,null,null,null,null,"Nitrate as NO3","No","Nitrate","Ulceby","GWSGZ0287",null,null,null,null,null,null,null,"Modelling suggests interventions will have impact in the medium term. Programme of engagement to make contact with land managers in the catchment with a view to raising awareness, sharing information and providing advice on best practice. The aim being to improve understanding of future risk, and maintain and ultimately improve water quality and reduce treatment need. Activities to be targeted in Safeguard Zones based on trials and options appraisal undertaken in AMP6. ",null,null,"",null,null,null,null,null,null,null,null,null,null,null,null,null,null,null,null,2085,null,null,null,null,null,39591,null,3.1E-2,1,1,1,"WWN","£m",1]
["EAN00422","Changed",null,null,null,"WQ","Anglian","East Anglia","Anglian Water Services Ltd","7AW202261","DrWPA - Trowse Newton","Broadland Rivers Chalk & Crag","GB40501G400300","Groundwater","Broadland Rivers Chalk and Crag",null,null,null,"DrWPA_IMP","Nitrate",null,null,null,null,"Catchment Measure","2025-03-31","Amber","7/34/14/*G/0090",624110,306060,null,null,"Programme to engage with land managers in the catchment with a view to raising awareness, sharing information and providing advice on best practice. The aim being to improve understanding of future risk, and maintain and ultimately improve water quality and reduce treatment need. Activities to be based on trials and options appraisals undertaken in AMP6. Modelling suggests interventions will have an impact in the medium term.",null,null,null,null,null,null,null,null,null,null,null,null,null,null,null,null,null,null,null,null,null,null,"Nitrate as NO3",null,"Nitrate",null,null,null,null,null,null,null,null,null,null,null,null,null,null,null,null,null,null,null,null,null,null,null,null,null,null,null,null,null,1522,null,null,null,null,"Nitrate treatment",null,null,3.1E-2,1,1,1,"WWN","£m",1]
["EAN00424","Changed",null,null,null,"WQ","Anglian","East Anglia","Anglian Water Services Ltd","7AW202263","DrWPA - Glandford","North Norfolk Chalk","GB40501G400100","Groundwater","North Norfolk Chalk",null,null,null,"DrWPA_IMP","Nitrate",null,null,null,null,"Catchment Measure","2025-03-31","Amber","7/34/04/*G/0055",604920,341890,null,null,"Programme to engage with land managers in the catchment with a view to raising awareness, sharing information and providing advice on best practice. The aim being to improve understanding of future risk, and maintain and ultimately improve water quality and reduce treatment need. Activities to be based on trials and options appraisals undertaken in AMP6. Modelling suggests interventions will have an impact in the medium term.",null,null,null,null,null,null,null,null,null,null,null,null,null,null,null,null,null,null,null,null,null,null,"Nitrate as NO3",null,"Nitrate","Glandford","GWSGZ0012",null,null,null,null,null,null,null,null,null,null,null,null,null,null,null,null,null,null,null,null,null,null,null,null,null,null,null,1426,null,null,null,null,"Confirm trends with view to potential removal of treatment",null,null,3.1E-2,1,1,1,"WWN","£m",1]
["EAN00428","Changed",null,null,null,"WQ","Anglian","East Anglia","Anglian Water Services Ltd","7AW202265","DrWPA - Beachamwell","Cam and Ely Ouse Chalk","GB40501G400500","Groundwater","Cam and Ely Ouse Chalk",null,null,null,"DrWPA_IMP","Nitrate",null,null,null,null,"Catchment Measure","2025-03-31","Amber","6/33/49/*G/0051",574150,304250,null,null,"Programme to engage with land managers in the catchment with a view to raising awareness, sharing information and providing advice on best practice. The aim being to improve understanding of future risk, arrest the rising trend and avoid the need for additional treatment. Activities to be based on trials and options appraisals undertaken in AMP6. Modelling suggests interventions will have an impact in the medium term.",null,null,null,null,null,null,null,null,null,null,null,null,null,null,null,null,null,null,null,null,null,null,"Nitrate as NO3",null,"Nitrate","Beachamwell","GWSGZ0317",null,null,null,null,null,null,null,null,null,null,null,null,null,null,null,null,null,null,null,null,null,null,null,null,null,null,null,3938,null,null,null,null,"Nitrate treatment. Environmental outcome (the volume of water protected): (984.5 x 4) = 3938.0 Ml/yr.",null,null,3.1E-2,1,1,1,"WWN","£m",1]
["EAN00430","Changed",null,null,null,"WQ","Anglian","East Anglia","Anglian Water Services Ltd","7AW202266","DrWPA - Isleham","Cam and Ely Ouse Chalk","GB40501G400500","Groundwater","Cam and Ely Ouse Chalk",null,null,null,"DrWPA_IMP","Nitrate",null,null,null,null,"Catchment Measure","2025-03-31","Amber","6/33/39/*G/0008",564150,272930,null,null,"Programme to engage with land managers in the catchment with a view to raising awareness, sharing information and providing advice on best practice. The aim being to improve understanding of future risk, and maintain and ultimately improve water quality and reduce treatment need. Activities to be based on trials and options appraisals undertaken in AMP6. Modelling suggests interventions will have an impact in the medium term.",null,null,null,null,null,null,null,null,null,null,null,null,null,null,null,null,null,null,null,null,null,null,"Nitrate as NO3",null,"Nitrate","Isleham","GWSGZ0326",null,null,null,null,null,null,null,null,null,null,null,null,null,null,null,null,null,null,null,null,null,null,null,null,null,null,null,816.8,null,null,null,null,"Nitrate treatment. Environmental outcome (the volume of water improved): (155.4 x 4) + (21.6 x 2) + 151.8 = 816.8 Ml/yr.",null,null,3.1E-2,1,1,1,"WWN","£m",1]
["EAN00431","Changed",null,null,null,"WQ","Anglian","East Anglia","Anglian Water Services Ltd","7AW202267","DrWPA - Lower Links","Cam and Ely Ouse Chalk","GB40501G400500","Groundwater","Cam and Ely Ouse Chalk",null,null,null,"DrWPA_IMP","Nitrate",null,null,null,null,"Catchment Measure","2025-03-31","Amber","6/33/36/*G/0006",563430,260920,null,null,"Programme to engage with land managers in the catchment with a view to raising awareness, sharing information and providing advice on best practice. The aim being to improve understanding of future risk, and maintain and ultimately improve water quality and reduce treatment need. Activities to be based on trials and options appraisals undertaken in AMP6. Modelling suggests interventions will have an impact in the medium term.",null,null,null,null,null,null,null,null,null,null,null,null,null,null,null,null,null,null,null,null,null,null,"Nitrate as NO3",null,"Nitrate","Lower Links","GWSGZ0327",null,null,null,null,null,null,null,null,null,null,null,null,null,null,null,null,null,null,null,null,null,null,null,null,null,null,null,660,null,null,null,null,"Confirm downward trends with view to potential removal of treatment. Environmental outcome (the volume of water improved): (220 x 3) = 660 Ml/yr.",null,null,3.1E-2,1,1,1,"WWN","£m",1]
["EAN00432","Changed",null,null,null,"WQ","Anglian","East Anglia","Anglian Water Services Ltd","7AW202268","DrWPA - Moulton","Cam and Ely Ouse Chalk","GB40501G400500","Groundwater","Cam and Ely Ouse Chalk",null,null,null,"DrWPA_IMP","Nitrate",null,null,null,null,"Catchment Measure","2025-03-31","Amber","6/33/38/*G/0028",569950,264550,null,null,"Programme to engage with land managers in the catchment with a view to raising awareness, sharing information and providing advice on best practice. The aim being to improve understanding of future risk, and maintain and ultimately improve water quality and reduce treatment need. Activities to be based on trials and options appraisals undertaken in AMP6. Modelling suggests interventions will have an impact in the medium term.",null,null,null,null,null,null,null,null,null,null,null,null,null,null,null,null,null,null,null,null,null,null,"Nitrate as NO3",null,"Nitrate","Moulton","GWSGZ0329",null,null,null,null,null,null,null,null,null,null,null,null,null,null,null,null,null,null,null,null,null,null,null,null,null,null,null,752.8,null,null,null,null,"Nitrate treatment. ",null,null,3.1E-2,1,1,1,"WWN","£m",1]
["EAN00434","Changed",null,null,null,"WQ","Anglian","East Anglia","Anglian Water Services Ltd","7AW202269","DrWPA - Nunnery Lodge","Cam and Ely Ouse Chalk","GB40501G400500","Groundwater","Cam and Ely Ouse Chalk",null,null,null,"DrWPA_IMP","Nitrate",null,null,null,null,"Catchment Measure","2025-03-31","Amber","6/33/43/*G/0026",587890,282220,null,null,"Programme to engage with land managers in the catchment with a view to raising awareness, sharing information and providing advice on best practice. The aim being to improve understanding of future risk, and maintain and ultimately improve water quality and reduce treatment need. Activities to be based on trials and options appraisals undertaken in AMP6. Modelling suggests interventions will have an impact in the medium term.",null,null,null,null,null,null,null,null,null,null,null,null,null,null,null,null,null,null,null,null,null,null,"Nitrate as NO3",null,"Nitrate","Nunnery Lodge","GWSGZ0330",null,null,null,null,null,null,null,null,null,null,null,null,null,null,null,null,null,null,null,null,null,null,null,null,null,null,null,1370.4,null,null,null,null,"Nitrate treatment. Environmental outcome (the volume of water improved): (685.2 x 2) = 1370.4 Ml/yr.",null,null,3.1E-2,1,1,1,"WWN","£m",1]
["EAN00437","Changed",null,null,null,"WQ","Anglian","East Anglia","Anglian Water Services Ltd","7AW202270","DrWPA - Square Plantation","Cam and Ely Ouse Chalk","GB40501G400500","Groundwater","Cam and Ely Ouse Chalk",null,null,null,"DrWPA_IMP","Nitrate",null,null,null,null,"Catchment Measure","2025-03-31","Amber","AN/033/0044/021",595590,283370,null,null,"Programme to engage with land managers in the catchment with a view to raising awareness, sharing information and providing advice on best practice. The aim being to improve understanding of future risk, and maintain and ultimately improve water quality and reduce treatment need. Activities to be based on trials and options appraisals undertaken in AMP6. Modelling suggests interventions will have an impact in the medium term.",null,null,null,null,null,null,null,null,null,null,null,null,null,null,null,null,null,null,null,null,null,null,"Nitrate as NO3",null,"Nitrate","Square Plantation","GWSGZ0333",null,null,null,null,null,null,null,null,null,null,null,null,null,null,null,null,null,null,null,null,null,null,null,null,null,null,null,406,null,null,null,null,"Nitrate treatment. ",null,null,3.1E-2,1,1,1,"WWN","£m",1]
["EAN00442","Changed",null,null,null,"WQ","Anglian","East Anglia","Anglian Water Services Ltd","7AW202271","DrWPA - Fring","North West Norfolk Chalk","GB40501G400200","Groundwater","North West Norfolk Chalk",null,null,null,"DrWPA_IMP","Nitrate",null,null,null,null,"Catchment Measure","2025-03-31","Amber","6/33/66/*G/0008",574250,334310,null,null,"Programme to engage with land managers in the catchment with a view to raising awareness, sharing information and providing advice on best practice. The aim being to improve understanding of future risk, and maintain and ultimately improve water quality and reduce treatment need. Activities to be based on trials and options appraisals undertaken in AMP6. Modelling suggests interventions will have an impact in the medium term.",null,null,null,null,null,null,null,null,null,null,null,null,null,null,null,null,null,null,null,null,null,null,"Nitrate as NO3",null,"Nitrate","Fring","GWSGZ0321",null,null,null,null,null,null,null,null,null,null,null,null,null,null,null,null,null,null,null,null,null,null,null,null,null,null,null,245.8,null,null,null,null,"Nitrate treatment",null,null,3.1E-2,1,1,1,"WWN","£m",1]
["EAN00443","Changed",null,null,null,"WQ","Anglian","East Anglia","Anglian Water Services Ltd","7AW202272","DrWPA - Fring Osier Carr","North West Norfolk Chalk","GB40501G400200","Groundwater","North West Norfolk Chalk",null,null,null,"DrWPA_IMP","Nitrate",null,null,null,null,"Catchment Measure","2025-03-31","Amber","6/33/66/*G/0043",575090,334050,null,null,"Programme to engage with land managers in the catchment with a view to raising awareness, sharing information and providing advice on best practice. The aim being to improve understanding of future risk, and maintain and ultimately improve water quality and reduce treatment need. Activities to be based on trials and options appraisals undertaken in AMP6. Modelling suggests interventions will have an impact in the medium term.",null,null,null,null,null,null,null,null,null,null,null,null,null,null,null,null,null,null,null,null,null,null,"Nitrate as NO3",null,"Nitrate","Fring Osier Carr","GWSGZ0322",null,null,null,null,null,null,null,null,null,null,null,null,null,null,null,null,null,null,null,null,null,null,null,null,null,null,null,568.9,null,null,null,null,"Nitrate treatment",null,null,3.1E-2,1,1,1,"WWN","£m",1]
["EAN00445","Changed",null,null,null,"WQ","Anglian","East Anglia","Anglian Water Services Ltd","7AW202273","DrWPA - Great Bircham","North West Norfolk Chalk","GB40501G400200","Groundwater","North West Norfolk Chalk",null,null,null,"DrWPA_IMP","Nitrate",null,null,null,null,"Catchment Measure","2025-03-31","Amber","6/33/66/*G/0007",575410,333710,null,null,"Programme to engage with land managers in the catchment with a view to raising awareness, sharing information and providing advice on best practice. The aim being to improve understanding of future risk, and maintain and ultimately improve water quality and reduce treatment need. Activities to be based on trials and options appraisals undertaken in AMP6. Modelling suggests interventions will have an impact in the medium term.",null,null,null,null,null,null,null,null,null,null,null,null,null,null,null,null,null,null,null,null,null,null,"Nitrate as NO3",null,"Nitrate","Great Bircham","GWSGZ0324",null,null,null,null,null,null,null,null,null,null,null,null,null,null,null,null,null,null,null,null,null,null,null,null,null,null,null,1033.5999999999999,null,null,null,null,"Nitrate treatment. Environmental outcome (the volume of water protected): (516.8 x 2) = 1033.6 Ml/yr.",null,null,3.1E-2,1,1,1,"WWN","£m",1]
["EAN00446","Changed",null,null,null,"WQ","Anglian","East Anglia","Anglian Water Services Ltd","7AW202274","DrWPA - Hillington (Chalk)","North West Norfolk Chalk","GB40501G400200","Groundwater","North West Norfolk Chalk",null,null,null,"DrWPA_IMP","Nitrate",null,null,null,null,"Catchment Measure","2025-03-31","Amber","6/33/64/*G/0025",574330,326210,null,null,"Programme to engage with land managers in the catchment with a view to raising awareness, sharing information and providing advice on best practice. The aim being to improve understanding of future risk, and maintain and ultimately improve water quality and reduce treatment need. Activities to be based on trials and options appraisals undertaken in AMP6. Modelling suggests interventions will have an impact in the medium term.",null,null,null,null,null,null,null,null,null,null,null,null,null,null,null,null,null,null,null,null,null,null,"Nitrate as NO3",null,"Nitrate","Hillington (chalk) ","GWSGZ0325",null,null,null,null,null,null,null,null,null,null,null,null,null,null,null,null,null,null,null,null,null,null,null,null,null,null,null,1782.7,null,null,null,null,"Nitrate treatment",null,null,3.1E-2,1,1,1,"WWN","£m",1]
["CHM00048","Addition",null,null,null,"WQ","Anglian","East Anglia","Anglian Water Services Ltd","7AW300048","Tuddenham STW (CIP2 T2)","Tuddenham Stream","GB105033043010","River","Lark",null,null,null,"WFD_IMP_CHEM",null,null,null,null,null,"Continuous Discharge","2024-12-31","Amber","ASENF1962",574362,270754,null,null,null,null,null,null,null,null,null,null,null,null,null,null,null,null,null,null,null,null,null,null,null,null,"Copper (dissolved)",null,null,null,null,null,null,null,"15.11 ug/l (dissolved mean)",null,null,null,null,null,null,null,null,null,null,null,null,null,null,null,null,null,null,null,null,null,null,7.1]
["EAN02408","Addition",null,null,null,"WQ","Anglian","East Anglia","Anglian Water Services Ltd","7AW300467","Watton STW","Watton Brook","GB105033047870","River","Wissey",null,null,null,"WFD_IMPm","Phosphorus",null,null,null,null,"Continuous Discharge","2024-12-22","Amber","AECNF10530",588560,300220,null,null,null,null,null,null,null,null,null,null,null,null,null,null,null,null,null,null,null,null,null,null,null,null,null,null,null,null,null,null,15115,"2 (UWWTD)",0.5,"No change required",2650,null,"Stretch target of 0.25 mg/l as laid out in the operating agreement linked to the permit must be met",null,null,null,"",null,null,null,null,null,null,null,null,null,null,null,null,null,null,34.5,null,null,null,null,null,null,"This site formed part of the AMP6 '0.1 mg/l  P-removal' trial.   Data collected during the trial showed that only 0.5 mg/l mean effluent quality was reliably achievable using the Dynasand technology.  \nDuring the trial, river quality recorded at the dowstream sample point was right on the Good/Moderate status boundary, even though SIMCAT modelling suggests a permit limit of 0.25 mg/l is required.  \nIn combination with upstream P-removal at Carbrooke STW it is considered that Good phosphate status is achievable in the Watton Brook.\nEnvironmental Outcome measured: \n8.5 km Watton Brook, from point of mixing to River Wissey (Poor to Moderate, but 'stretch' target could deliver Good))\n26 km Lower Wissey, Watton Brook to Cut-Off Channel (Moderate to Good)\nMarch 2018 update:  Scheme discussed with Mel Farmer.  Agreed to an initial 3-year trial period using stetch limit of 0.25 mg/l as part of permit Operating Agreement.   Effectiveness of this trial to be assessed before making the arrangement permanent.",null,null,0.41599999999999998,1,1,1,"WWN","£m",1]
["LNA00380","Addition",null,null,null,"WQ","Anglian","Lincolnshire and Northamptonshire","Anglian Water Services Ltd","7AW300487","Kirmington STW","Skitter Beck / East Halton Beck","GB104029067655","River","Becks Northern",null,null,null,"WFD_IMPg","Phosphorus",null,null,null,null,"Continuous Discharge","2024-12-22","Amber","AW3NF113",511300,411700,null,null,null,null,null,null,null,null,null,null,null,null,null,null,null,null,null,null,null,null,null,null,null,null,null,null,null,null,null,null,605,null,"0.25mg/l (AA)","Total Iron= 4mg/l (95%ile) 8mg/l (MAC)",null,null,null,null,null,null,"",null,null,null,null,null,null,null,null,null,null,null,null,null,null,6.23,null,null,null,null,null,null,"Part of cost beneficial bundle for operational catchment"]
["EAN02441 "," "," "," "," "," WR "," Anglian "," East Anglia "," Anglian Water Services Ltd "," 7AW100426 "," N NORFOLK Ch GW / East Ruston, Witton "," North Norfolk Chalk "," GB40501G400100 "," Groundwater "," North Norfolk Chalk "," WFDGW "," NDINV "," WFDGW_NDINV_GWR "," "," "," "," "," ","Investigation and Options Appraisal",44651,"########"," Green "," AN/034/0009/024  ",null," "," "," As for other licences in Investigation 7AW100433. ",null," GW Category 2 "," "," "," "," "," "," "," "," "," "," "," "," "," "," "," "," "," "," "," "," "," "," "," "," "," "," "," "," "," "," "," "," "," "," "," "," North Norfolk Chalk "," GB40501G400100 "," CAT3 "," "," "," "," "," "," "," "," "," "," "," "," "," "," "," "," "," "," "," "," "," "," "," ",2.2999999999999998,2,5,1,"WN"," £m ",1," Added East Ruston scheme as not included (PR19 Final determination: Anglian Water Cost efficiency final determination appendix page 16) ",null,null,null,null,null,null,null,null,null," "," "," "," "," "," "," "," "," "," "," "," "," "," "," "," "]

{"sheet":"InpActive","index":8,"n_rows":48,"n_cols":19,"rows_kept":48,"cut":false,"hidden":false,"merged":[]}
[{"$f":" RIGHT(CELL(\"filename\", $A$1), LEN(CELL(\"filename\", $A$1)) - SEARCH(\"]\", CELL(\"filename\", $A$1)))","v":"InpActive"}]
[null,null,null,null,{"$f":"Time!E25","v":"Model period ending"},{"$f":"Check!F2","v":0},"Checks",null,null,{"$f":" Time!J$25","v":"2019-03-31"},{"$f":" Time!K$25","v":"2020-03-31"},{"$f":" Time!L$25","v":"2021-03-31"},{"$f":" Time!M$25","v":"2022-03-31"},{"$f":" Time!N$25","v":"2023-03-31"},{"$f":" Time!O$25","v":"2024-03-31"},{"$f":" Time!P$25","v":"2025-03-31"},{"$f":" Time!Q$25","v":"2026-03-31"},{"$f":" Time!R$25","v":"2027-03-31"},{"$f":" Time!S$25","v":"2028-03-31"}]
[null,null,null,null,{"$f":"Time!E107","v":"Timeline label"},{"$f":"Check!F3","v":3},"Track chgs",null,null,{"$f":" Time!J$107","v":"Pre-Fcst"},{"$f":" Time!K$107","v":"Pre-Fcst"},{"$f":" Time!L$107","v":"Forecast"},{"$f":" Time!M$107","v":"Forecast"},{"$f":" Time!N$107","v":"Forecast"},{"$f":" Time!O$107","v":"Forecast"},{"$f":" Time!P$107","v":"Forecast"},{"$f":" Time!Q$107","v":"Post-Fcst"},{"$f":" Time!R$107","v":"Post-Fcst"},{"$f":" Time!S$107","v":"Post-Fcst"}]
[null,null,null,null,{"$f":"Time!E130","v":"Financial year ending"},null,null,null,null,{"$f":" Time!J$130","v":2019},{"$f":" Time!K$130","v":2020},{"$f":" Time!L$130","v":2021},{"$f":" Time!M$130","v":2022},{"$f":" Time!N$130","v":2023},{"$f":" Time!O$130","v":2024},{"$f":" Time!P$130","v":2025},{"$f":" Time!Q$130","v":2026},{"$f":" Time!R$130","v":2027},{"$f":" Time!S$130","v":2028}]
[null,null,null,null,{"$f":"Time!E10","v":"Model column counter"},"Constant","Unit","Total",null,{"$f":" Time!J$10","v":1},{"$f":" Time!K$10","v":2},{"$f":" Time!L$10","v":3},{"$f":" Time!M$10","v":4},{"$f":" Time!N$10","v":5},{"$f":" Time!O$10","v":6},{"$f":" Time!P$10","v":7},{"$f":" Time!Q$10","v":8},{"$f":" Time!R$10","v":9},{"$f":" Time!S$10","v":10}]
[]
["A: TIME"]
[]
[null,"Timeline setup"]
[]
[null,null,"Timeline start dates"]
[null,null,null,null,"1st model column start date","2018-04-01","date","Date should be the first date of the financial year"]
[]
[null,null,"Financial year inputs"]
[null,null,null,null,"First modelling column financial year #",2019,"year #","Financial model start year"]
[null,null,null,null,"Financial year end month number #",3,"month #","Month of financial year end for financial model"]
[]
[null,null,"Timeline labels"]
[null,null,null,null,"Pre - forecast period","Pre-Fcst","label"]
[null,null,null,null,"Forecast period","Forecast","label"]
[null,null,null,null,"Post - forecast period","Post-Fcst","label"]
[]
[null,"Project dates"]
[]
[null,null,null,null,"Forecast start date","2020-04-01","date"]
[null,null,null,null,"Forecast duration",5,"years"]
[null,null,null,null,"Forecast duration (text)","2020-25","years #","For Info only"]
[]
[null,null,null,null,"Forecast period reconcilation is profiled from",3,"year"]
[]
["B: FINANCING INPUTS"]
[]
[null,null,null,null,"Financing cost index",null,"Index",null,null,null,null,4,3,2,1,0]
[]
[null,null,null,null,"Financing Cost",3.1199999999999999E-2,"%"]
[]
["C: NON CHANGEABLE MODEL TECHNICAL INPUTS"]
[]
[null,null,null,null,"Months per model period",12,"months"]
[]
[null,null,null,null,"Track Tolerance Level",1E-3,"tolerance"]
[null,null,null,null,"Check Tolerance Level",9.9999999999999995E-8,"tolerance"]
[]
[null,null,null,null,"Thousands in a million",1000,"thousands"]
[null,null,null,null,"Units in a million",1000000,"unit"]
[null,null,null,null,"Unit conversion to percentage",100,"unit"]
[]
["End of sheet"]

{"sheet":"Calcs >>","index":9,"n_rows":0,"n_cols":0,"rows_kept":0,"cut":false,"hidden":false,"merged":[]}

{"sheet":"WINEP_Schemes","index":10,"n_rows":253,"n_cols":14,"rows_kept":253,"cut":false,"hidden":false,"merged":[]}
[{"$f":" RIGHT(CELL(\"filename\", $A$1), LEN(CELL(\"filename\", $A$1)) - SEARCH(\"]\", CELL(\"filename\", $A$1)))","v":"WINEP_Schemes"}]
[null,null,null,null,null,{"$f":" Check!F2","v":0},"Checks"]
[null,null,null,null,null,{"$f":" Check!F3","v":3},"Track chgs"]
[]
["AMBER WINEP SCHEMES"]
[]
[null,null,"List of WINEP schemes that were unconfirmed at FD"]
[null,null,"The lines below are examples with some dummy inputs."]
[null,null,"WINEPID","Unique ID","Scheme category / name","Unit","Unit Conversion to £m",null,"Allowed totex unit rate","Quantity in PR19 FD","Quantity Delivered","1 = In FD, funded\n0 = In FD, not funded","Price Control","Proportion Confirmed"]
[null,null,{"$f":" WINEP_Inputs!A5","v":"EMD00013"},{"$f":" WINEP_Inputs!J5","v":"7AW100069"},{"$f":" WINEP_Inputs!K5","v":"River Poulter - Elkesley boreholes (1,2,3,4,5,6,7)"},{"$f":"WINEP_Inputs!CW5","v":0},{"$f":"WINEP_Inputs!CX5","v":0},null,{"$f":" WINEP_Inputs!CR5","v":0},{"$f":" WINEP_Inputs!CS5","v":0},{"$f":" WINEP_Inputs!CT5","v":0},{"$f":" WINEP_Inputs!CU5","v":0},{"$f":" WINEP_Inputs!CV5","v":0},{"$f":" IF(K10 = 0, 0, K10 / J10)","v":0}]
[null,null,{"$f":" WINEP_Inputs!A6","v":"EMD00014"},{"$f":" WINEP_Inputs!J6","v":"7AW100070"},{"$f":" WINEP_Inputs!K6","v":"River Idle from Maun/Poulter to Tiln (Ordsall BOREHOLES 1,2 and Whisker Hill)"},{"$f":"WINEP_Inputs!CW6","v":0},{"$f":"WINEP_Inputs!CX6","v":0},null,{"$f":" WINEP_Inputs!CR6","v":0},{"$f":" WINEP_Inputs!CS6","v":0},{"$f":" WINEP_Inputs!CT6","v":0},{"$f":" WINEP_Inputs!CU6","v":0},{"$f":" WINEP_Inputs!CV6","v":0},0]
[null,null,{"$f":" WINEP_Inputs!A7","v":"EMD00015"},{"$f":" WINEP_Inputs!J7","v":"7AW100070"},{"$f":" WINEP_Inputs!K7","v":"River Idle from Maun/Poulter to Tiln (Grove BOREHOLES 1,2,3,4)"},{"$f":"WINEP_Inputs!CW7","v":0},{"$f":"WINEP_Inputs!CX7","v":0},null,{"$f":" WINEP_Inputs!CR7","v":0},{"$f":" WINEP_Inputs!CS7","v":0},{"$f":" WINEP_Inputs!CT7","v":0},{"$f":" WINEP_Inputs!CU7","v":0},{"$f":" WINEP_Inputs!CV7","v":0},0]
[null,null,{"$f":" WINEP_Inputs!A8","v":"EMD00016"},{"$f":" WINEP_Inputs!J8","v":"7AW100071"},{"$f":" WINEP_Inputs!K8","v":"Idle from Ryton to Trent - Everton boreholes (1,2,3,4,5,6)"},{"$f":"WINEP_Inputs!CW8","v":0},{"$f":"WINEP_Inputs!CX8","v":0},null,{"$f":" WINEP_Inputs!CR8","v":0},{"$f":" WINEP_Inputs!CS8","v":0},{"$f":" WINEP_Inputs!CT8","v":0},{"$f":" WINEP_Inputs!CU8","v":0},{"$f":" WINEP_Inputs!CV8","v":0},0]
[null,null,{"$f":" WINEP_Inputs!A9","v":"EAN00363"},{"$f":" WINEP_Inputs!J9","v":"7AW100085"},{"$f":" WINEP_Inputs!K9","v":"Implementation Scheme: Undertake river restoration to mitigate the effects of abstraction. The river restoration project will be planned to ensure good biosecurity practices are observed, pathways of spread of invasive species are mitigated and the resultant project brings about biodiversity enhancements."},{"$f":"WINEP_Inputs!CW9","v":"£m"},{"$f":"WINEP_Inputs!CX9","v":1},null,{"$f":" WINEP_Inputs!CR9","v":0.109},{"$f":" WINEP_Inputs!CS9","v":1},{"$f":" WINEP_Inputs!CT9","v":1},{"$f":" WINEP_Inputs!CU9","v":1},{"$f":" WINEP_Inputs!CV9","v":"WR"},1]
[null,null,{"$f":" WINEP_Inputs!A10","v":"EAN00364"},{"$f":" WINEP_Inputs!J10","v":"7AW100085"},{"$f":" WINEP_Inputs!K10","v":"Implementation Scheme: Undertake river restoration to mitigate the effects of abstraction. The river restoration project will be planned to ensure good biosecurity practices are observed, pathways of spread of invasive species are mitigated and the resultant project brings about biodiversity enhancements."},{"$f":"WINEP_Inputs!CW10","v":"£m"},{"$f":"WINEP_Inputs!CX10","v":1},null,{"$f":" WINEP_Inputs!CR10","v":0.312},{"$f":" WINEP_Inputs!CS10","v":1},{"$f":" WINEP_Inputs!CT10","v":1},{"$f":" WINEP_Inputs!CU10","v":1},{"$f":" WINEP_Inputs!CV10","v":"WR"},1]
[null,null,{"$f":" WINEP_Inputs!A11","v":"EAN00365"},{"$f":" WINEP_Inputs!J11","v":"7AW100085"},{"$f":" WINEP_Inputs!K11","v":"Implementation Scheme: Undertake river restoration to mitigate the effects of abstraction. The river restoration project will be planned to ensure good biosecurity practices are observed, pathways of spread of invasive species are mitigated and the resultant project brings about biodiversity enhancements."},{"$f":"WINEP_Inputs!CW11","v":"£m"},{"$f":"WINEP_Inputs!CX11","v":1},null,{"$f":" WINEP_Inputs!CR11","v":0.33300000000000002},{"$f":" WINEP_Inputs!CS11","v":1},{"$f":" WINEP_Inputs!CT11","v":1},{"$f":" WINEP_Inputs!CU11","v":1},{"$f":" WINEP_Inputs!CV11","v":"WR"},{"$f":" IF(K16 = 0, 0, K16 / J16)","v":1}]
[null,null,{"$f":" WINEP_Inputs!A12","v":"EAN00109"},{"$f":" WINEP_Inputs!J12","v":"7AW100086"},{"$f":" WINEP_Inputs!K12","v":"Birchmoor"},{"$f":"WINEP_Inputs!CW12","v":"£m"},{"$f":"WINEP_Inputs!CX12","v":1},null,{"$f":" WINEP_Inputs!CR12","v":1.3959999999999999},{"$f":" WINEP_Inputs!CS12","v":1},{"$f":" WINEP_Inputs!CT12","v":1},{"$f":" WINEP_Inputs!CU12","v":1},{"$f":" WINEP_Inputs!CV12","v":"WR"},1]
[null,null,{"$f":" WINEP_Inputs!A13","v":"EAN00359"},{"$f":" WINEP_Inputs!J13","v":"7AW100086"},{"$f":" WINEP_Inputs!K13","v":"Implementation Scheme: Undertake river restoration to mitigate the effects of abstraction. The river restoration project will be planned to ensure good biosecurity practices are observed, pathways of spread of invasive species are mitigated and the resultant project brings about biodiversity enhancements."},{"$f":"WINEP_Inputs!CW13","v":"£m"},{"$f":"WINEP_Inputs!CX13","v":1},null,{"$f":" WINEP_Inputs!CR13","v":9.8000000000000004E-2},{"$f":" WINEP_Inputs!CS13","v":1},{"$f":" WINEP_Inputs!CT13","v":1},{"$f":" WINEP_Inputs!CU13","v":1},{"$f":" WINEP_Inputs!CV13","v":"WR"},1]
[null,null,{"$f":" WINEP_Inputs!A14","v":"EAN02383"},{"$f":" WINEP_Inputs!J14","v":"7AW100087"},{"$f":" WINEP_Inputs!K14","v":"Implementation Scheme: Undertake river restoration to mitigate the effects of abstraction. The river restoration project will be planned to ensure good biosecurity practices are observed, pathways of spread of invasive species are mitigated and the resultant project brings about biodiversity enhancements."},{"$f":"WINEP_Inputs!CW14","v":"£m"},{"$f":"WINEP_Inputs!CX14","v":1},null,{"$f":" WINEP_Inputs!CR14","v":0.59499999999999997},{"$f":" WINEP_Inputs!CS14","v":1},{"$f":" WINEP_Inputs!CT14","v":1},{"$f":" WINEP_Inputs!CU14","v":1},{"$f":" WINEP_Inputs!CV14","v":"WR"},1]
[null,null,{"$f":" WINEP_Inputs!A15","v":"EAN02384"},{"$f":" WINEP_Inputs!J15","v":"7AW100087"},{"$f":" WINEP_Inputs!K15","v":"Implementation Scheme: Undertake river restoration to mitigate the effects of abstraction. The river restoration project will be planned to ensure good biosecurity practices are observed, pathways of spread of invasive species are mitigated and the resultant project brings about biodiversity enhancements."},{"$f":"WINEP_Inputs!CW15","v":"£m"},{"$f":"WINEP_Inputs!CX15","v":1},null,{"$f":" WINEP_Inputs!CR15","v":0.626},{"$f":" WINEP_Inputs!CS15","v":1},{"$f":" WINEP_Inputs!CT15","v":1},{"$f":" WINEP_Inputs!CU15","v":1},{"$f":" WINEP_Inputs!CV15","v":"WR"},1]
[null,null,{"$f":" WINEP_Inputs!A16","v":"EAN00114"},{"$f":" WINEP_Inputs!J16","v":"7AW100088"},{"$f":" WINEP_Inputs!K16","v":"Isleham"},{"$f":"WINEP_Inputs!CW16","v":"£m"},{"$f":"WINEP_Inputs!CX16","v":1},null,{"$f":" WINEP_Inputs!CR16","v":1.55},{"$f":" WINEP_Inputs!CS16","v":1},{"$f":" WINEP_Inputs!CT16","v":1},{"$f":" WINEP_Inputs!CU16","v":1},{"$f":" WINEP_Inputs!CV16","v":"WR"},1]
[null,null,{"$f":" WINEP_Inputs!A17","v":"EAN00361"},{"$f":" WINEP_Inputs!J17","v":"7AW100088"},{"$f":" WINEP_Inputs!K17","v":"Implementation Scheme: Undertake river restoration to mitigate the effects of abstraction. The river restoration project will be planned to ensure good biosecurity practices are observed, pathways of spread of invasive species are mitigated and the resultant project brings about biodiversity enhancements."},{"$f":"WINEP_Inputs!CW17","v":"£m"},{"$f":"WINEP_Inputs!CX17","v":1},null,{"$f":" WINEP_Inputs!CR17","v":0.308},{"$f":" WINEP_Inputs!CS17","v":1},{"$f":" WINEP_Inputs!CT17","v":1},{"$f":" WINEP_Inputs!CU17","v":1},{"$f":" WINEP_Inputs!CV17","v":"WR"},1]
[null,null,{"$f":" WINEP_Inputs!A18","v":"EAN00129"},{"$f":" WINEP_Inputs!J18","v":"7AW100090"},{"$f":" WINEP_Inputs!K18","v":"Rushbrooke"},{"$f":"WINEP_Inputs!CW18","v":"£m"},{"$f":"WINEP_Inputs!CX18","v":1},null,{"$f":" WINEP_Inputs!CR18","v":1.1339999999999999},{"$f":" WINEP_Inputs!CS18","v":1},{"$f":" WINEP_Inputs!CT18","v":1},{"$f":" WINEP_Inputs!CU18","v":1},{"$f":" WINEP_Inputs!CV18","v":"WR"},1]
[null,null,{"$f":" WINEP_Inputs!A19","v":"EAN00360"},{"$f":" WINEP_Inputs!J19","v":"7AW100090"},{"$f":" WINEP_Inputs!K19","v":"Implementation Scheme: Undertake river restoration to mitigate the effects of abstraction. The river restoration project will be planned to ensure good biosecurity practices are observed, pathways of spread of invasive species are mitigated and the resultant project brings about biodiversity enhancements."},{"$f":"WINEP_Inputs!CW19","v":"£m"},{"$f":"WINEP_Inputs!CX19","v":1},null,{"$f":" WINEP_Inputs!CR19","v":0.317},{"$f":" WINEP_Inputs!CS19","v":1},{"$f":" WINEP_Inputs!CT19","v":1},{"$f":" WINEP_Inputs!CU19","v":1},{"$f":" WINEP_Inputs!CV19","v":"WR"},1]
[null,null,{"$f":" WINEP_Inputs!A20","v":"EAN00366"},{"$f":" WINEP_Inputs!J20","v":"7AW100091"},{"$f":" WINEP_Inputs!K20","v":"Implementation Scheme: Undertake river restoration to mitigate the effects of abstraction. The river restoration project will be planned to ensure good biosecurity practices are observed, pathways of spread of invasive species are mitigated and the resultant project brings about biodiversity enhancements."},{"$f":"WINEP_Inputs!CW20","v":"£m"},{"$f":"WINEP_Inputs!CX20","v":1},null,{"$f":" WINEP_Inputs!CR20","v":0.45800000000000002},{"$f":" WINEP_Inputs!CS20","v":1},{"$f":" WINEP_Inputs!CT20","v":1},{"$f":" WINEP_Inputs!CU20","v":1},{"$f":" WINEP_Inputs!CV20","v":"WR"},1]
[null,null,{"$f":" WINEP_Inputs!A21","v":"EAN00367"},{"$f":" WINEP_Inputs!J21","v":"7AW100092"},{"$f":" WINEP_Inputs!K21","v":"Implementation Scheme: Undertake river restoration to mitigate the effects of abstraction. The river restoration project will be planned to ensure good biosecurity practices are observed, pathways of spread of invasive species are mitigated and the resultant project brings about biodiversity enhancements."},{"$f":"WINEP_Inputs!CW21","v":"£m"},{"$f":"WINEP_Inputs!CX21","v":1},null,{"$f":" WINEP_Inputs!CR21","v":0.31},{"$f":" WINEP_Inputs!CS21","v":1},{"$f":" WINEP_Inputs!CT21","v":1},{"$f":" WINEP_Inputs!CU21","v":1},{"$f":" WINEP_Inputs!CV21","v":"WR"},1]
[null,null,{"$f":" WINEP_Inputs!A22","v":"EAN00133"},{"$f":" WINEP_Inputs!J22","v":"7AW100093"},{"$f":" WINEP_Inputs!K22","v":"Stanton/Ixworth"},{"$f":"WINEP_Inputs!CW22","v":"£m"},{"$f":"WINEP_Inputs!CX22","v":1},null,{"$f":" WINEP_Inputs!CR22","v":0.72799999999999998},{"$f":" WINEP_Inputs!CS22","v":1},{"$f":" WINEP_Inputs!CT22","v":1},{"$f":" WINEP_Inputs!CU22","v":1},{"$f":" WINEP_Inputs!CV22","v":"WR"},1]
[null,null,{"$f":" WINEP_Inputs!A23","v":"EAN02388"},{"$f":" WINEP_Inputs!J23","v":"7AW100093"},{"$f":" WINEP_Inputs!K23","v":"Implementation Scheme: Undertake river restoration to mitigate the effects of abstraction. The river restoration project will be planned to ensure good biosecurity practices are observed, pathways of spread of invasive species are mitigated and the resultant project brings about biodiversity enhancements."},{"$f":"WINEP_Inputs!CW23","v":"£m"},{"$f":"WINEP_Inputs!CX23","v":1},null,{"$f":" WINEP_Inputs!CR23","v":0.39500000000000002},{"$f":" WINEP_Inputs!CS23","v":1},{"$f":" WINEP_Inputs!CT23","v":1},{"$f":" WINEP_Inputs!CU23","v":1},{"$f":" WINEP_Inputs!CV23","v":"WR"},1]
[null,null,{"$f":" WINEP_Inputs!A24","v":"EAN02389"},{"$f":" WINEP_Inputs!J24","v":"7AW100093"},{"$f":" WINEP_Inputs!K24","v":"Implementation Scheme: Undertake river restoration to mitigate the effects of abstraction. The river restoration project will be planned to ensure good biosecurity practices are observed, pathways of spread of invasive species are mitigated and the resultant project brings about biodiversity enhancements."},{"$f":"WINEP_Inputs!CW24","v":"£m"},{"$f":"WINEP_Inputs!CX24","v":1},null,{"$f":" WINEP_Inputs!CR24","v":0.441},{"$f":" WINEP_Inputs!CS24","v":1},{"$f":" WINEP_Inputs!CT24","v":1},{"$f":" WINEP_Inputs!CU24","v":1},{"$f":" WINEP_Inputs!CV24","v":"WR"},1]
[null,null,{"$f":" WINEP_Inputs!A25","v":"EAN02390"},{"$f":" WINEP_Inputs!J25","v":"7AW100093"},{"$f":" WINEP_Inputs!K25","v":"Stanton/Ixworth"},{"$f":"WINEP_Inputs!CW25","v":"£m"},{"$f":"WINEP_Inputs!CX25","v":1},null,{"$f":" WINEP_Inputs!CR25","v":0.41099999999999998},{"$f":" WINEP_Inputs!CS25","v":1},{"$f":" WINEP_Inputs!CT25","v":1},{"$f":" WINEP_Inputs!CU25","v":1},{"$f":" WINEP_Inputs!CV25","v":"WR"},1]
[null,null,{"$f":" WINEP_Inputs!A26","v":"EAN02414"},{"$f":" WINEP_Inputs!J26","v":"7AW100093"},{"$f":" WINEP_Inputs!K26","v":"Stanton/Ixworth"},{"$f":"WINEP_Inputs!CW26","v":"£m"},{"$f":"WINEP_Inputs!CX26","v":1},null,{"$f":" WINEP_Inputs!CR26","v":0.41099999999999998},{"$f":" WINEP_Inputs!CS26","v":1},{"$f":" WINEP_Inputs!CT26","v":1},{"$f":" WINEP_Inputs!CU26","v":1},{"$f":" WINEP_Inputs!CV26","v":"WR"},1]
[null,null,{"$f":" WINEP_Inputs!A27","v":"EAN00136"},{"$f":" WINEP_Inputs!J27","v":"7AW100270"},{"$f":" WINEP_Inputs!K27","v":"WEST RUNTON COMMON / West Runton, Sheringham"},{"$f":"WINEP_Inputs!CW27","v":"£m"},{"$f":"WINEP_Inputs!CX27","v":1},null,{"$f":" WINEP_Inputs!CR27","v":0.48399999999999999},{"$f":" WINEP_Inputs!CS27","v":1},{"$f":" WINEP_Inputs!CT27","v":1},{"$f":" WINEP_Inputs!CU27","v":1},{"$f":" WINEP_Inputs!CV27","v":"WR"},1]
[null,null,{"$f":" WINEP_Inputs!A28","v":"EAN00138"},{"$f":" WINEP_Inputs!J28","v":"7AW100272"},{"$f":" WINEP_Inputs!K28","v":"TIFFEY / High Oak"},{"$f":"WINEP_Inputs!CW28","v":"£m"},{"$f":"WINEP_Inputs!CX28","v":1},null,{"$f":" WINEP_Inputs!CR28","v":1.125},{"$f":" WINEP_Inputs!CS28","v":1},{"$f":" WINEP_Inputs!CT28","v":1},{"$f":" WINEP_Inputs!CU28","v":1},{"$f":" WINEP_Inputs!CV28","v":"WR"},1]
[null,null,{"$f":" WINEP_Inputs!A29","v":"EAN00139"},{"$f":" WINEP_Inputs!J29","v":"7AW100272"},{"$f":" WINEP_Inputs!K29","v":"TIFFEY / High Oak"},{"$f":"WINEP_Inputs!CW29","v":"£m"},{"$f":"WINEP_Inputs!CX29","v":1},null,{"$f":" WINEP_Inputs!CR29","v":1.125},{"$f":" WINEP_Inputs!CS29","v":1},{"$f":" WINEP_Inputs!CT29","v":1},{"$f":" WINEP_Inputs!CU29","v":1},{"$f":" WINEP_Inputs!CV29","v":"WR"},1]
[null,null,{"$f":" WINEP_Inputs!A30","v":"EAN00140"},{"$f":" WINEP_Inputs!J30","v":"7AW100273"},{"$f":" WINEP_Inputs!K30","v":"BRETT / Semer, Raydon"},{"$f":"WINEP_Inputs!CW30","v":0},{"$f":"WINEP_Inputs!CX30","v":0},null,{"$f":" WINEP_Inputs!CR30","v":0},{"$f":" WINEP_Inputs!CS30","v":0},{"$f":" WINEP_Inputs!CT30","v":0},{"$f":" WINEP_Inputs!CU30","v":0},{"$f":" WINEP_Inputs!CV30","v":0},0]
[null,null,{"$f":" WINEP_Inputs!A31","v":"EAN02422"},{"$f":" WINEP_Inputs!J31","v":"7AW100273"},{"$f":" WINEP_Inputs!K31","v":"BRETT / Semer, Raydon"},{"$f":"WINEP_Inputs!CW31","v":0},{"$f":"WINEP_Inputs!CX31","v":0},null,{"$f":" WINEP_Inputs!CR31","v":0},{"$f":" WINEP_Inputs!CS31","v":0},{"$f":" WINEP_Inputs!CT31","v":0},{"$f":" WINEP_Inputs!CU31","v":0},{"$f":" WINEP_Inputs!CV31","v":0},0]
[null,null,{"$f":" WINEP_Inputs!A32","v":"LNA00001"},{"$f":" WINEP_Inputs!J32","v":"7AW101744"},{"$f":" WINEP_Inputs!K32","v":"BARNOLDBY - BORES A - D"},{"$f":"WINEP_Inputs!CW32","v":"£m"},{"$f":"WINEP_Inputs!CX32","v":1},null,{"$f":" WINEP_Inputs!CR32","v":0.217},{"$f":" WINEP_Inputs!CS32","v":1},{"$f":" WINEP_Inputs!CT32","v":1},{"$f":" WINEP_Inputs!CU32","v":1},{"$f":" WINEP_Inputs!CV32","v":"WR"},1]
[null,null,{"$f":" WINEP_Inputs!A33","v":"LNA00002"},{"$f":" WINEP_Inputs!J33","v":"7AW101744"},{"$f":" WINEP_Inputs!K33","v":"WEELSBY BORES A - E"},{"$f":"WINEP_Inputs!CW33","v":"£m"},{"$f":"WINEP_Inputs!CX33","v":1},null,{"$f":" WINEP_Inputs!CR33","v":0.217},{"$f":" WINEP_Inputs!CS33","v":1},{"$f":" WINEP_Inputs!CT33","v":1},{"$f":" WINEP_Inputs!CU33","v":1},{"$f":" WINEP_Inputs!CV33","v":"WR"},1]
[null,null,{"$f":" WINEP_Inputs!A34","v":"LNA00027"},{"$f":" WINEP_Inputs!J34","v":"7AW101744"},{"$f":" WINEP_Inputs!K34","v":"TETNEY"},{"$f":"WINEP_Inputs!CW34","v":"£m"},{"$f":"WINEP_Inputs!CX34","v":1},null,{"$f":" WINEP_Inputs!CR34","v":0.217},{"$f":" WINEP_Inputs!CS34","v":1},{"$f":" WINEP_Inputs!CT34","v":1},{"$f":" WINEP_Inputs!CU34","v":1},{"$f":" WINEP_Inputs!CV34","v":"WR"},1]
[null,null,{"$f":" WINEP_Inputs!A35","v":"LNA00028"},{"$f":" WINEP_Inputs!J35","v":"7AW101744"},{"$f":" WINEP_Inputs!K35","v":"FULSTOW - BORES 1 -2"},{"$f":"WINEP_Inputs!CW35","v":"£m"},{"$f":"WINEP_Inputs!CX35","v":1},null,{"$f":" WINEP_Inputs!CR35","v":0.217},{"$f":" WINEP_Inputs!CS35","v":1},{"$f":" WINEP_Inputs!CT35","v":1},{"$f":" WINEP_Inputs!CU35","v":1},{"$f":" WINEP_Inputs!CV35","v":"WR"},1]
[null,null,{"$f":" WINEP_Inputs!A36","v":"LNA00033"},{"$f":" WINEP_Inputs!J36","v":"7AW101744"},{"$f":" WINEP_Inputs!K36","v":"HABROUGH - BORES 1 -3"},{"$f":"WINEP_Inputs!CW36","v":"£m"},{"$f":"WINEP_Inputs!CX36","v":1},null,{"$f":" WINEP_Inputs!CR36","v":0.217},{"$f":" WINEP_Inputs!CS36","v":1},{"$f":" WINEP_Inputs!CT36","v":1},{"$f":" WINEP_Inputs!CU36","v":1},{"$f":" WINEP_Inputs!CV36","v":"WR"},1]
[null,null,{"$f":" WINEP_Inputs!A37","v":"LNA00034"},{"$f":" WINEP_Inputs!J37","v":"7AW101744"},{"$f":" WINEP_Inputs!K37","v":"LITTLE LONDON - BORES 1 - 4"},{"$f":"WINEP_Inputs!CW37","v":"£m"},{"$f":"WINEP_Inputs!CX37","v":1},null,{"$f":" WINEP_Inputs!CR37","v":0.217},{"$f":" WINEP_Inputs!CS37","v":1},{"$f":" WINEP_Inputs!CT37","v":1},{"$f":" WINEP_Inputs!CU37","v":1},{"$f":" WINEP_Inputs!CV37","v":"WR"},1]
[null,null,{"$f":" WINEP_Inputs!A38","v":"LNA00035"},{"$f":" WINEP_Inputs!J38","v":"7AW101744"},{"$f":" WINEP_Inputs!K38","v":"HEALING - BORES A-F"},{"$f":"WINEP_Inputs!CW38","v":"£m"},{"$f":"WINEP_Inputs!CX38","v":1},null,{"$f":" WINEP_Inputs!CR38","v":0.217},{"$f":" WINEP_Inputs!CS38","v":1},{"$f":" WINEP_Inputs!CT38","v":1},{"$f":" WINEP_Inputs!CU38","v":1},{"$f":" WINEP_Inputs!CV38","v":"WR"},1]
[null,null,{"$f":" WINEP_Inputs!A39","v":"LNA00036"},{"$f":" WINEP_Inputs!J39","v":"7AW101744"},{"$f":" WINEP_Inputs!K39","v":"THORNTON CURTIS - BORES 1-3"},{"$f":"WINEP_Inputs!CW39","v":"£m"},{"$f":"WINEP_Inputs!CX39","v":1},null,{"$f":" WINEP_Inputs!CR39","v":0.217},{"$f":" WINEP_Inputs!CS39","v":1},{"$f":" WINEP_Inputs!CT39","v":1},{"$f":" WINEP_Inputs!CU39","v":1},{"$f":" WINEP_Inputs!CV39","v":"WR"},1]
[null,null,{"$f":" WINEP_Inputs!A40","v":"LNA00037"},{"$f":" WINEP_Inputs!J40","v":"7AW101744"},{"$f":" WINEP_Inputs!K40","v":"BARROW BORES 1 - 7"},{"$f":"WINEP_Inputs!CW40","v":"£m"},{"$f":"WINEP_Inputs!CX40","v":1},null,{"$f":" WINEP_Inputs!CR40","v":0.217},{"$f":" WINEP_Inputs!CS40","v":1},{"$f":" WINEP_Inputs!CT40","v":1},{"$f":" WINEP_Inputs!CU40","v":1},{"$f":" WINEP_Inputs!CV40","v":"WR"},1]
[null,null,{"$f":" WINEP_Inputs!A41","v":"LNA00038"},{"$f":" WINEP_Inputs!J41","v":"7AW101744"},{"$f":" WINEP_Inputs!K41","v":"BARTON - BORES 1 -3"},{"$f":"WINEP_Inputs!CW41","v":"£m"},{"$f":"WINEP_Inputs!CX41","v":1},null,{"$f":" WINEP_Inputs!CR41","v":0.217},{"$f":" WINEP_Inputs!CS41","v":1},{"$f":" WINEP_Inputs!CT41","v":1},{"$f":" WINEP_Inputs!CU41","v":1},{"$f":" WINEP_Inputs!CV41","v":"WR"},1]
[null,null,{"$f":" WINEP_Inputs!A42","v":"LNA00039"},{"$f":" WINEP_Inputs!J42","v":"7AW101744"},{"$f":" WINEP_Inputs!K42","v":"ULCEBY - BORES 1 - 3"},{"$f":"WINEP_Inputs!CW42","v":"£m"},{"$f":"WINEP_Inputs!CX42","v":1},null,{"$f":" WINEP_Inputs!CR42","v":0.217},{"$f":" WINEP_Inputs!CS42","v":1},{"$f":" WINEP_Inputs!CT42","v":1},{"$f":" WINEP_Inputs!CU42","v":1},{"$f":" WINEP_Inputs!CV42","v":"WR"},1]
[null,null,{"$f":" WINEP_Inputs!A43","v":"LNA00040"},{"$f":" WINEP_Inputs!J43","v":"7AW101744"},{"$f":" WINEP_Inputs!K43","v":"GOXHILL"},{"$f":"WINEP_Inputs!CW43","v":"£m"},{"$f":"WINEP_Inputs!CX43","v":1},null,{"$f":" WINEP_Inputs!CR43","v":0.217},{"$f":" WINEP_Inputs!CS43","v":1},{"$f":" WINEP_Inputs!CT43","v":1},{"$f":" WINEP_Inputs!CU43","v":1},{"$f":" WINEP_Inputs!CV43","v":"WR"},1]
[null,null,{"$f":" WINEP_Inputs!A44","v":"LNA00029"},{"$f":" WINEP_Inputs!J44","v":"7AW101750"},{"$f":" WINEP_Inputs!K44","v":"WELTON BORES 6 - 10"},{"$f":"WINEP_Inputs!CW44","v":"£m"},{"$f":"WINEP_Inputs!CX44","v":1},null,{"$f":" WINEP_Inputs!CR44","v":0.47},{"$f":" WINEP_Inputs!CS44","v":1},{"$f":" WINEP_Inputs!CT44","v":1},{"$f":" WINEP_Inputs!CU44","v":1},{"$f":" WINEP_Inputs!CV44","v":"WR"},1]
[null,null,{"$f":" WINEP_Inputs!A45","v":"LNA00032"},{"$f":" WINEP_Inputs!J45","v":"7AW101750"},{"$f":" WINEP_Inputs!K45","v":"NEW BOREHOLE - SPRIDLINGTON 11"},{"$f":"WINEP_Inputs!CW45","v":"£m"},{"$f":"WINEP_Inputs!CX45","v":1},null,{"$f":" WINEP_Inputs!CR45","v":0.47},{"$f":" WINEP_Inputs!CS45","v":1},{"$f":" WINEP_Inputs!CT45","v":1},{"$f":" WINEP_Inputs!CU45","v":1},{"$f":" WINEP_Inputs!CV45","v":"WR"},1]
[null,null,{"$f":" WINEP_Inputs!A46","v":"LNA00007"},{"$f":" WINEP_Inputs!J46","v":"7AW101752"},{"$f":" WINEP_Inputs!K46","v":"BILLINGBOROUGH - BORES A - D"},{"$f":"WINEP_Inputs!CW46","v":"£m"},{"$f":"WINEP_Inputs!CX46","v":1},null,{"$f":" WINEP_Inputs!CR46","v":0.86099999999999999},{"$f":" WINEP_Inputs!CS46","v":1},{"$f":" WINEP_Inputs!CT46","v":1},{"$f":" WINEP_Inputs!CU46","v":1},{"$f":" WINEP_Inputs!CV46","v":"WR"},1]
[null,null,{"$f":" WINEP_Inputs!A47","v":"LNA00007"},{"$f":" WINEP_Inputs!J47","v":"7AW101752"},{"$f":" WINEP_Inputs!K47","v":"PINCHBECK Jockey P.S. BOREHOLE 2"},{"$f":"WINEP_Inputs!CW47","v":0},{"$f":"WINEP_Inputs!CX47","v":0},null,{"$f":" WINEP_Inputs!CR47","v":0},{"$f":" WINEP_Inputs!CS47","v":0},{"$f":" WINEP_Inputs!CT47","v":0},{"$f":" WINEP_Inputs!CU47","v":0},{"$f":" WINEP_Inputs!CV47","v":0},0]
[null,null,{"$f":" WINEP_Inputs!A48","v":"LNA00011"},{"$f":" WINEP_Inputs!J48","v":"7AW101752"},{"$f":" WINEP_Inputs!K48","v":"ASLACKBY PUMPING STATION"},{"$f":"WINEP_Inputs!CW48","v":0},{"$f":"WINEP_Inputs!CX48","v":0},null,{"$f":" WINEP_Inputs!CR48","v":0},{"$f":" WINEP_Inputs!CS48","v":0},{"$f":" WINEP_Inputs!CT48","v":0},{"$f":" WINEP_Inputs!CU48","v":0},{"$f":" WINEP_Inputs!CV48","v":0},0]
[null,null,{"$f":" WINEP_Inputs!A49","v":"LNA00012"},{"$f":" WINEP_Inputs!J49","v":"7AW101752"},{"$f":" WINEP_Inputs!K49","v":"RIPPINGALE PUMPING STATION"},{"$f":"WINEP_Inputs!CW49","v":0},{"$f":"WINEP_Inputs!CX49","v":0},null,{"$f":" WINEP_Inputs!CR49","v":0},{"$f":" WINEP_Inputs!CS49","v":0},{"$f":" WINEP_Inputs!CT49","v":0},{"$f":" WINEP_Inputs!CU49","v":0},{"$f":" WINEP_Inputs!CV49","v":0},0]
[null,null,{"$f":" WINEP_Inputs!A50","v":"LNA00013"},{"$f":" WINEP_Inputs!J50","v":"7AW101752"},{"$f":" WINEP_Inputs!K50","v":"SWATON"},{"$f":"WINEP_Inputs!CW50","v":0},{"$f":"WINEP_Inputs!CX50","v":0},null,{"$f":" WINEP_Inputs!CR50","v":0},{"$f":" WINEP_Inputs!CS50","v":0},{"$f":" WINEP_Inputs!CT50","v":0},{"$f":" WINEP_Inputs!CU50","v":0},{"$f":" WINEP_Inputs!CV50","v":0},0]
[null,null,{"$f":" WINEP_Inputs!A51","v":"LNA00020"},{"$f":" WINEP_Inputs!J51","v":"7AW101752"},{"$f":" WINEP_Inputs!K51","v":"DROVE LANE AND CLAY HILL"},{"$f":"WINEP_Inputs!CW51","v":0},{"$f":"WINEP_Inputs!CX51","v":0},null,{"$f":" WINEP_Inputs!CR51","v":0},{"$f":" WINEP_Inputs!CS51","v":0},{"$f":" WINEP_Inputs!CT51","v":0},{"$f":" WINEP_Inputs!CU51","v":0},{"$f":" WINEP_Inputs!CV51","v":0},0]
[null,null,{"$f":" WINEP_Inputs!A52","v":"LNA00021"},{"$f":" WINEP_Inputs!J52","v":"7AW101752"},{"$f":" WINEP_Inputs!K52","v":"ASWARBY"},{"$f":"WINEP_Inputs!CW52","v":0},{"$f":"WINEP_Inputs!CX52","v":0},null,{"$f":" WINEP_Inputs!CR52","v":0},{"$f":" WINEP_Inputs!CS52","v":0},{"$f":" WINEP_Inputs!CT52","v":0},{"$f":" WINEP_Inputs!CU52","v":0},{"$f":" WINEP_Inputs!CV52","v":0},0]
[null,null,{"$f":" WINEP_Inputs!A53","v":"LNA00024"},{"$f":" WINEP_Inputs!J53","v":"7AW101752"},{"$f":" WINEP_Inputs!K53","v":"KIRKBY LA THORPE"},{"$f":"WINEP_Inputs!CW53","v":0},{"$f":"WINEP_Inputs!CX53","v":0},null,{"$f":" WINEP_Inputs!CR53","v":0},{"$f":" WINEP_Inputs!CS53","v":0},{"$f":" WINEP_Inputs!CT53","v":0},{"$f":" WINEP_Inputs!CU53","v":0},{"$f":" WINEP_Inputs!CV53","v":0},0]
[null,null,{"$f":" WINEP_Inputs!A54","v":"LNA00042"},{"$f":" WINEP_Inputs!J54","v":"7AW101752"},{"$f":" WINEP_Inputs!K54","v":"West Pinchbeck"},{"$f":"WINEP_Inputs!CW54","v":0},{"$f":"WINEP_Inputs!CX54","v":0},null,{"$f":" WINEP_Inputs!CR54","v":0},{"$f":" WINEP_Inputs!CS54","v":0},{"$f":" WINEP_Inputs!CT54","v":0},{"$f":" WINEP_Inputs!CU54","v":0},{"$f":" WINEP_Inputs!CV54","v":0},0]
[null,null,{"$f":" WINEP_Inputs!A55","v":"LNA00043"},{"$f":" WINEP_Inputs!J55","v":"7AW101752"},{"$f":" WINEP_Inputs!K55","v":"Haconby"},{"$f":"WINEP_Inputs!CW55","v":0},{"$f":"WINEP_Inputs!CX55","v":0},null,{"$f":" WINEP_Inputs!CR55","v":0},{"$f":" WINEP_Inputs!CS55","v":0},{"$f":" WINEP_Inputs!CT55","v":0},{"$f":" WINEP_Inputs!CU55","v":0},{"$f":" WINEP_Inputs!CV55","v":0},0]
[null,null,{"$f":" WINEP_Inputs!A56","v":"LNA00014"},{"$f":" WINEP_Inputs!J56","v":"7AW101756"},{"$f":" WINEP_Inputs!K56","v":"WILSTHORPE"},{"$f":"WINEP_Inputs!CW56","v":"£m"},{"$f":"WINEP_Inputs!CX56","v":1},null,{"$f":" WINEP_Inputs!CR56","v":0.41399999999999998},{"$f":" WINEP_Inputs!CS56","v":1},{"$f":" WINEP_Inputs!CT56","v":1},{"$f":" WINEP_Inputs!CU56","v":1},{"$f":" WINEP_Inputs!CV56","v":"WR"},1]
[null,null,{"$f":" WINEP_Inputs!A57","v":"LNA00016"},{"$f":" WINEP_Inputs!J57","v":"7AW101756"},{"$f":" WINEP_Inputs!K57","v":"BOURNE"},{"$f":"WINEP_Inputs!CW57","v":0},{"$f":"WINEP_Inputs!CX57","v":0},null,{"$f":" WINEP_Inputs!CR57","v":0},{"$f":" WINEP_Inputs!CS57","v":0},{"$f":" WINEP_Inputs!CT57","v":0},{"$f":" WINEP_Inputs!CU57","v":0},{"$f":" WINEP_Inputs!CV57","v":0},0]
[null,null,{"$f":" WINEP_Inputs!A58","v":"LNA00099"},{"$f":" WINEP_Inputs!J58","v":"7AW101757"},{"$f":" WINEP_Inputs!K58","v":"WILSTHORPE"},{"$f":"WINEP_Inputs!CW58","v":"£m"},{"$f":"WINEP_Inputs!CX58","v":1},null,{"$f":" WINEP_Inputs!CR58","v":0.91},{"$f":" WINEP_Inputs!CS58","v":1},{"$f":" WINEP_Inputs!CT58","v":1},{"$f":" WINEP_Inputs!CU58","v":1},{"$f":" WINEP_Inputs!CV58","v":"WR"},1]
[null,null,{"$f":" WINEP_Inputs!A59","v":"LNA00100"},{"$f":" WINEP_Inputs!J59","v":"7AW101757"},{"$f":" WINEP_Inputs!K59","v":"BOURNE"},{"$f":"WINEP_Inputs!CW59","v":0},{"$f":"WINEP_Inputs!CX59","v":0},null,{"$f":" WINEP_Inputs!CR59","v":0},{"$f":" WINEP_Inputs!CS59","v":0},{"$f":" WINEP_Inputs!CT59","v":0},{"$f":" WINEP_Inputs!CU59","v":0},{"$f":" WINEP_Inputs!CV59","v":0},0]
[null,null,{"$f":" WINEP_Inputs!A60","v":"LNA00018"},{"$f":" WINEP_Inputs!J60","v":"7AW101761"},{"$f":" WINEP_Inputs!K60","v":"WANEHAM BRIDGE"},{"$f":"WINEP_Inputs!CW60","v":0},{"$f":"WINEP_Inputs!CX60","v":0},null,{"$f":" WINEP_Inputs!CR60","v":0},{"$f":" WINEP_Inputs!CS60","v":0},{"$f":" WINEP_Inputs!CT60","v":0},{"$f":" WINEP_Inputs!CU60","v":0},{"$f":" WINEP_Inputs!CV60","v":0},0]
[null,null,{"$f":" WINEP_Inputs!A61","v":"LNA00019"},{"$f":" WINEP_Inputs!J61","v":"7AW101761"},{"$f":" WINEP_Inputs!K61","v":"MOOR FARM"},{"$f":"WINEP_Inputs!CW61","v":0},{"$f":"WINEP_Inputs!CX61","v":0},null,{"$f":" WINEP_Inputs!CR61","v":0},{"$f":" WINEP_Inputs!CS61","v":0},{"$f":" WINEP_Inputs!CT61","v":0},{"$f":" WINEP_Inputs!CU61","v":0},{"$f":" WINEP_Inputs!CV61","v":0},0]
[null,null,{"$f":" WINEP_Inputs!A62","v":"LNA00106"},{"$f":" WINEP_Inputs!J62","v":"7AW101761"},{"$f":" WINEP_Inputs!K62","v":"Branston Booths"},{"$f":"WINEP_Inputs!CW62","v":0},{"$f":"WINEP_Inputs!CX62","v":0},null,{"$f":" WINEP_Inputs!CR62","v":0},{"$f":" WINEP_Inputs!CS62","v":0},{"$f":" WINEP_Inputs!CT62","v":0},{"$f":" WINEP_Inputs!CU62","v":0},{"$f":" WINEP_Inputs!CV62","v":0},0]
[null,null,{"$f":" WINEP_Inputs!A63","v":"LNA00041"},{"$f":" WINEP_Inputs!J63","v":"7AW101783"},{"$f":" WINEP_Inputs!K63","v":"RUTLAND WATER/GWASH FLOWS"},{"$f":"WINEP_Inputs!CW63","v":"£m"},{"$f":"WINEP_Inputs!CX63","v":1},null,{"$f":" WINEP_Inputs!CR63","v":0.46300000000000002},{"$f":" WINEP_Inputs!CS63","v":1},{"$f":" WINEP_Inputs!CT63","v":1},{"$f":" WINEP_Inputs!CU63","v":1},{"$f":" WINEP_Inputs!CV63","v":"WR"},1]
[null,null,{"$f":" WINEP_Inputs!A64","v":"EAN00470"},{"$f":" WINEP_Inputs!J64","v":"7AW200053"},{"$f":" WINEP_Inputs!K64","v":"Ashbrook STW"},{"$f":"WINEP_Inputs!CW64","v":"£m"},{"$f":"WINEP_Inputs!CX64","v":1},null,{"$f":" WINEP_Inputs!CR64","v":1.98},{"$f":" WINEP_Inputs!CS64","v":1},{"$f":" WINEP_Inputs!CT64","v":1},{"$f":" WINEP_Inputs!CU64","v":1},{"$f":" WINEP_Inputs!CV64","v":"WWN"},1]
[null,null,{"$f":" WINEP_Inputs!A65","v":"EAN00471"},{"$f":" WINEP_Inputs!J65","v":"7AW200054"},{"$f":" WINEP_Inputs!K65","v":"Ashton STW"},{"$f":"WINEP_Inputs!CW65","v":"£m"},{"$f":"WINEP_Inputs!CX65","v":1},null,{"$f":" WINEP_Inputs!CR65","v":3.7050000000000001},{"$f":" WINEP_Inputs!CS65","v":1},{"$f":" WINEP_Inputs!CT65","v":1},{"$f":" WINEP_Inputs!CU65","v":1},{"$f":" WINEP_Inputs!CV65","v":"WWN"},1]
[null,null,{"$f":" WINEP_Inputs!A66","v":"EAN00474"},{"$f":" WINEP_Inputs!J66","v":"7AW200057"},{"$f":" WINEP_Inputs!K66","v":"Bassingbourn STW"},{"$f":"WINEP_Inputs!CW66","v":"£m"},{"$f":"WINEP_Inputs!CX66","v":1},null,{"$f":" WINEP_Inputs!CR66","v":1.895},{"$f":" WINEP_Inputs!CS66","v":1},{"$f":" WINEP_Inputs!CT66","v":1},{"$f":" WINEP_Inputs!CU66","v":1},{"$f":" WINEP_Inputs!CV66","v":"WWN"},1]
[null,null,{"$f":" WINEP_Inputs!A67","v":"EAN00475"},{"$f":" WINEP_Inputs!J67","v":"7AW200058"},{"$f":" WINEP_Inputs!K67","v":"Beachampton STW"},{"$f":"WINEP_Inputs!CW67","v":"£m"},{"$f":"WINEP_Inputs!CX67","v":1},null,{"$f":" WINEP_Inputs!CR67","v":1.133},{"$f":" WINEP_Inputs!CS67","v":1},{"$f":" WINEP_Inputs!CT67","v":1},{"$f":" WINEP_Inputs!CU67","v":1},{"$f":" WINEP_Inputs!CV67","v":"WWN"},1]
[null,null,{"$f":" WINEP_Inputs!A68","v":"EAN00478"},{"$f":" WINEP_Inputs!J68","v":"7AW200061"},{"$f":" WINEP_Inputs!K68","v":"Blakesley STW"},{"$f":"WINEP_Inputs!CW68","v":"£m"},{"$f":"WINEP_Inputs!CX68","v":1},null,{"$f":" WINEP_Inputs!CR68","v":0.09},{"$f":" WINEP_Inputs!CS68","v":1},{"$f":" WINEP_Inputs!CT68","v":1},{"$f":" WINEP_Inputs!CU68","v":1},{"$f":" WINEP_Inputs!CV68","v":"WWN"},1]
[null,null,{"$f":" WINEP_Inputs!A69","v":"EAN00479"},{"$f":" WINEP_Inputs!J69","v":"7AW200062"},{"$f":" WINEP_Inputs!K69","v":"Bottisham STW"},{"$f":"WINEP_Inputs!CW69","v":"£m"},{"$f":"WINEP_Inputs!CX69","v":1},null,{"$f":" WINEP_Inputs!CR69","v":0.66100000000000003},{"$f":" WINEP_Inputs!CS69","v":1},{"$f":" WINEP_Inputs!CT69","v":1},{"$f":" WINEP_Inputs!CU69","v":1},{"$f":" WINEP_Inputs!CV69","v":"WWN"},1]
[null,null,{"$f":" WINEP_Inputs!A70","v":"EAN00480"},{"$f":" WINEP_Inputs!J70","v":"7AW200063"},{"$f":" WINEP_Inputs!K70","v":"Bourn STW"},{"$f":"WINEP_Inputs!CW70","v":"£m"},{"$f":"WINEP_Inputs!CX70","v":1},null,{"$f":" WINEP_Inputs!CR70","v":0.64200000000000002},{"$f":" WINEP_Inputs!CS70","v":1},{"$f":" WINEP_Inputs!CT70","v":1},{"$f":" WINEP_Inputs!CU70","v":1},{"$f":" WINEP_Inputs!CV70","v":"WWN"},1]
[null,null,{"$f":" WINEP_Inputs!A71","v":"EAN00481"},{"$f":" WINEP_Inputs!J71","v":"7AW200064"},{"$f":" WINEP_Inputs!K71","v":"Bradenham STW"},{"$f":"WINEP_Inputs!CW71","v":"£m"},{"$f":"WINEP_Inputs!CX71","v":1},null,{"$f":" WINEP_Inputs!CR71","v":0.222},{"$f":" WINEP_Inputs!CS71","v":1},{"$f":" WINEP_Inputs!CT71","v":1},{"$f":" WINEP_Inputs!CU71","v":1},{"$f":" WINEP_Inputs!CV71","v":"WWN"},1]
[null,null,{"$f":" WINEP_Inputs!A72","v":"EAN00483"},{"$f":" WINEP_Inputs!J72","v":"7AW200066"},{"$f":" WINEP_Inputs!K72","v":"Burwell STW"},{"$f":"WINEP_Inputs!CW72","v":"£m"},{"$f":"WINEP_Inputs!CX72","v":1},null,{"$f":" WINEP_Inputs!CR72","v":1.7929999999999999},{"$f":" WINEP_Inputs!CS72","v":1},{"$f":" WINEP_Inputs!CT72","v":1},{"$f":" WINEP_Inputs!CU72","v":1},{"$f":" WINEP_Inputs!CV72","v":"WWN"},1]
[null,null,{"$f":" WINEP_Inputs!A73","v":"EAN00484"},{"$f":" WINEP_Inputs!J73","v":"7AW200067"},{"$f":" WINEP_Inputs!K73","v":"Carbrooke Church Rd STW (FTRS Scheme)"},{"$f":"WINEP_Inputs!CW73","v":"£m"},{"$f":"WINEP_Inputs!CX73","v":1},null,{"$f":" WINEP_Inputs!CR73","v":1.252},{"$f":" WINEP_Inputs!CS73","v":1},{"$f":" WINEP_Inputs!CT73","v":1},{"$f":" WINEP_Inputs!CU73","v":1},{"$f":" WINEP_Inputs!CV73","v":"WWN"},1]
[null,null,{"$f":" WINEP_Inputs!A74","v":"EAN00485"},{"$f":" WINEP_Inputs!J74","v":"7AW200068"},{"$f":" WINEP_Inputs!K74","v":"Castlethorpe STW"},{"$f":"WINEP_Inputs!CW74","v":"£m"},{"$f":"WINEP_Inputs!CX74","v":1},null,{"$f":" WINEP_Inputs!CR74","v":0.09},{"$f":" WINEP_Inputs!CS74","v":1},{"$f":" WINEP_Inputs!CT74","v":1},{"$f":" WINEP_Inputs!CU74","v":1},{"$f":" WINEP_Inputs!CV74","v":"WWN"},1]
[null,null,{"$f":" WINEP_Inputs!A75","v":"EAN00486"},{"$f":" WINEP_Inputs!J75","v":"7AW200069"},{"$f":" WINEP_Inputs!K75","v":"Chippenham STW"},{"$f":"WINEP_Inputs!CW75","v":"£m"},{"$f":"WINEP_Inputs!CX75","v":1},null,{"$f":" WINEP_Inputs!CR75","v":0.157},{"$f":" WINEP_Inputs!CS75","v":1},{"$f":" WINEP_Inputs!CT75","v":1},{"$f":" WINEP_Inputs!CU75","v":1},{"$f":" WINEP_Inputs!CV75","v":"WWN"},{"$f":" IF(K80 = 0, 0, K80 / J80)","v":1}]
[null,null,{"$f":" WINEP_Inputs!A76","v":"EAN00488"},{"$f":" WINEP_Inputs!J76","v":"7AW200071"},{"$f":" WINEP_Inputs!K76","v":"Coney Weston STW"},{"$f":"WINEP_Inputs!CW76","v":0},{"$f":"WINEP_Inputs!CX76","v":0},null,{"$f":" WINEP_Inputs!CR76","v":0},{"$f":" WINEP_Inputs!CS76","v":0},{"$f":" WINEP_Inputs!CT76","v":0},{"$f":" WINEP_Inputs!CU76","v":0},{"$f":" WINEP_Inputs!CV76","v":0},0]
[null,null,{"$f":" WINEP_Inputs!A77","v":"EAN00489"},{"$f":" WINEP_Inputs!J77","v":"7AW200072"},{"$f":" WINEP_Inputs!K77","v":"Coton STW"},{"$f":"WINEP_Inputs!CW77","v":"£m"},{"$f":"WINEP_Inputs!CX77","v":1},null,{"$f":" WINEP_Inputs!CR77","v":1.18},{"$f":" WINEP_Inputs!CS77","v":1},{"$f":" WINEP_Inputs!CT77","v":1},{"$f":" WINEP_Inputs!CU77","v":1},{"$f":" WINEP_Inputs!CV77","v":"WWN"},1]
[null,null,{"$f":" WINEP_Inputs!A78","v":"EAN00490"},{"$f":" WINEP_Inputs!J78","v":"7AW200073"},{"$f":" WINEP_Inputs!K78","v":"Cublington (Wing) STW"},{"$f":"WINEP_Inputs!CW78","v":"£m"},{"$f":"WINEP_Inputs!CX78","v":1},null,{"$f":" WINEP_Inputs!CR78","v":2.5190000000000001},{"$f":" WINEP_Inputs!CS78","v":1},{"$f":" WINEP_Inputs!CT78","v":1},{"$f":" WINEP_Inputs!CU78","v":1},{"$f":" WINEP_Inputs!CV78","v":"WWN"},1]
[null,null,{"$f":" WINEP_Inputs!A79","v":"EAN00491"},{"$f":" WINEP_Inputs!J79","v":"7AW200074"},{"$f":" WINEP_Inputs!K79","v":"Doddington STW"},{"$f":"WINEP_Inputs!CW79","v":"£m"},{"$f":"WINEP_Inputs!CX79","v":1},null,{"$f":" WINEP_Inputs!CR79","v":0.59499999999999997},{"$f":" WINEP_Inputs!CS79","v":1},{"$f":" WINEP_Inputs!CT79","v":1},{"$f":" WINEP_Inputs!CU79","v":1},{"$f":" WINEP_Inputs!CV79","v":"WWN"},1]
[null,null,{"$f":" WINEP_Inputs!A80","v":"EAN00494"},{"$f":" WINEP_Inputs!J80","v":"7AW200077"},{"$f":" WINEP_Inputs!K80","v":"Elmdon STW"},{"$f":"WINEP_Inputs!CW80","v":"£m"},{"$f":"WINEP_Inputs!CX80","v":1},null,{"$f":" WINEP_Inputs!CR80","v":0.22500000000000001},{"$f":" WINEP_Inputs!CS80","v":1},{"$f":" WINEP_Inputs!CT80","v":1},{"$f":" WINEP_Inputs!CU80","v":1},{"$f":" WINEP_Inputs!CV80","v":"WWN"},1]
[null,null,{"$f":" WINEP_Inputs!A81","v":"EAN00495"},{"$f":" WINEP_Inputs!J81","v":"7AW200078"},{"$f":" WINEP_Inputs!K81","v":"Everton STW"},{"$f":"WINEP_Inputs!CW81","v":"£m"},{"$f":"WINEP_Inputs!CX81","v":1},null,{"$f":" WINEP_Inputs!CR81","v":1.585},{"$f":" WINEP_Inputs!CS81","v":1},{"$f":" WINEP_Inputs!CT81","v":1},{"$f":" WINEP_Inputs!CU81","v":1},{"$f":" WINEP_Inputs!CV81","v":"WWN"},1]
[null,null,{"$f":" WINEP_Inputs!A82","v":"EAN00498"},{"$f":" WINEP_Inputs!J82","v":"7AW200081"},{"$f":" WINEP_Inputs!K82","v":"Gazeley STW"},{"$f":"WINEP_Inputs!CW82","v":"£m"},{"$f":"WINEP_Inputs!CX82","v":1},null,{"$f":" WINEP_Inputs!CR82","v":0.56299999999999994},{"$f":" WINEP_Inputs!CS82","v":1},{"$f":" WINEP_Inputs!CT82","v":1},{"$f":" WINEP_Inputs!CU82","v":1},{"$f":" WINEP_Inputs!CV82","v":"WWN"},1]
[null,null,{"$f":" WINEP_Inputs!A83","v":"EAN00500"},{"$f":" WINEP_Inputs!J83","v":"7AW200083"},{"$f":" WINEP_Inputs!K83","v":"Great Horwood STW"},{"$f":"WINEP_Inputs!CW83","v":"£m"},{"$f":"WINEP_Inputs!CX83","v":1},null,{"$f":" WINEP_Inputs!CR83","v":1.879},{"$f":" WINEP_Inputs!CS83","v":1},{"$f":" WINEP_Inputs!CT83","v":1},{"$f":" WINEP_Inputs!CU83","v":1},{"$f":" WINEP_Inputs!CV83","v":"WWN"},1]
[null,null,{"$f":" WINEP_Inputs!A84","v":"EAN00501"},{"$f":" WINEP_Inputs!J84","v":"7AW200084"},{"$f":" WINEP_Inputs!K84","v":"Greens Norton STW"},{"$f":"WINEP_Inputs!CW84","v":"£m"},{"$f":"WINEP_Inputs!CX84","v":1},null,{"$f":" WINEP_Inputs!CR84","v":0.55800000000000005},{"$f":" WINEP_Inputs!CS84","v":1},{"$f":" WINEP_Inputs!CT84","v":1},{"$f":" WINEP_Inputs!CU84","v":1},{"$f":" WINEP_Inputs!CV84","v":"WWN"},1]
[null,null,{"$f":" WINEP_Inputs!A85","v":"EAN00503"},{"$f":" WINEP_Inputs!J85","v":"7AW200086"},{"$f":" WINEP_Inputs!K85","v":"Hanslope STW"},{"$f":"WINEP_Inputs!CW85","v":0},{"$f":"WINEP_Inputs!CX85","v":0},null,{"$f":" WINEP_Inputs!CR85","v":0},{"$f":" WINEP_Inputs!CS85","v":0},{"$f":" WINEP_Inputs!CT85","v":0},{"$f":" WINEP_Inputs!CU85","v":0},{"$f":" WINEP_Inputs!CV85","v":0},0]
[null,null,{"$f":" WINEP_Inputs!A86","v":"EAN00505"},{"$f":" WINEP_Inputs!J86","v":"7AW200088"},{"$f":" WINEP_Inputs!K86","v":"Hawstead STW"},{"$f":"WINEP_Inputs!CW86","v":"£m"},{"$f":"WINEP_Inputs!CX86","v":1},null,{"$f":" WINEP_Inputs!CR86","v":2.8460000000000001},{"$f":" WINEP_Inputs!CS86","v":1},{"$f":" WINEP_Inputs!CT86","v":1},{"$f":" WINEP_Inputs!CU86","v":1},{"$f":" WINEP_Inputs!CV86","v":"WWN"},1]
[null,null,{"$f":" WINEP_Inputs!A87","v":"EAN00507"},{"$f":" WINEP_Inputs!J87","v":"7AW200090"},{"$f":" WINEP_Inputs!K87","v":"Ivinghoe STW"},{"$f":"WINEP_Inputs!CW87","v":0},{"$f":"WINEP_Inputs!CX87","v":0},null,{"$f":" WINEP_Inputs!CR87","v":0},{"$f":" WINEP_Inputs!CS87","v":0},{"$f":" WINEP_Inputs!CT87","v":0},{"$f":" WINEP_Inputs!CU87","v":0},{"$f":" WINEP_Inputs!CV87","v":0},0]
[null,null,{"$f":" WINEP_Inputs!A88","v":"EAN00508"},{"$f":" WINEP_Inputs!J88","v":"7AW200091"},{"$f":" WINEP_Inputs!K88","v":"Lidgate STW"},{"$f":"WINEP_Inputs!CW88","v":"£m"},{"$f":"WINEP_Inputs!CX88","v":1},null,{"$f":" WINEP_Inputs!CR88","v":1.5820000000000001},{"$f":" WINEP_Inputs!CS88","v":1},{"$f":" WINEP_Inputs!CT88","v":1},{"$f":" WINEP_Inputs!CU88","v":1},{"$f":" WINEP_Inputs!CV88","v":"WWN"},1]
[null,null,{"$f":" WINEP_Inputs!A89","v":"EAN00509"},{"$f":" WINEP_Inputs!J89","v":"7AW200092"},{"$f":" WINEP_Inputs!K89","v":"Linton STW"},{"$f":"WINEP_Inputs!CW89","v":"£m"},{"$f":"WINEP_Inputs!CX89","v":1},null,{"$f":" WINEP_Inputs!CR89","v":0.79600000000000004},{"$f":" WINEP_Inputs!CS89","v":1},{"$f":" WINEP_Inputs!CT89","v":1},{"$f":" WINEP_Inputs!CU89","v":1},{"$f":" WINEP_Inputs!CV89","v":"WWN"},1]
[null,null,{"$f":" WINEP_Inputs!A90","v":"EAN00510"},{"$f":" WINEP_Inputs!J90","v":"7AW200093"},{"$f":" WINEP_Inputs!K90","v":"Litlington STW"},{"$f":"WINEP_Inputs!CW90","v":"£m"},{"$f":"WINEP_Inputs!CX90","v":1},null,{"$f":" WINEP_Inputs!CR90","v":1.96},{"$f":" WINEP_Inputs!CS90","v":1},{"$f":" WINEP_Inputs!CT90","v":1},{"$f":" WINEP_Inputs!CU90","v":1},{"$f":" WINEP_Inputs!CV90","v":"WWN"},1]
[null,null,{"$f":" WINEP_Inputs!A91","v":"EAN00512"},{"$f":" WINEP_Inputs!J91","v":"7AW200095"},{"$f":" WINEP_Inputs!K91","v":"Newport STW"},{"$f":"WINEP_Inputs!CW91","v":"£m"},{"$f":"WINEP_Inputs!CX91","v":1},null,{"$f":" WINEP_Inputs!CR91","v":0.09},{"$f":" WINEP_Inputs!CS91","v":1},{"$f":" WINEP_Inputs!CT91","v":1},{"$f":" WINEP_Inputs!CU91","v":1},{"$f":" WINEP_Inputs!CV91","v":"WWN"},1]
[null,null,{"$f":" WINEP_Inputs!A92","v":"EAN00514"},{"$f":" WINEP_Inputs!J92","v":"7AW200097"},{"$f":" WINEP_Inputs!K92","v":"Norton (Suffolk) STW"},{"$f":"WINEP_Inputs!CW92","v":"£m"},{"$f":"WINEP_Inputs!CX92","v":1},null,{"$f":" WINEP_Inputs!CR92","v":0.22800000000000001},{"$f":" WINEP_Inputs!CS92","v":1},{"$f":" WINEP_Inputs!CT92","v":1},{"$f":" WINEP_Inputs!CU92","v":1},{"$f":" WINEP_Inputs!CV92","v":"WWN"},1]
[null,null,{"$f":" WINEP_Inputs!A93","v":"EAN00515"},{"$f":" WINEP_Inputs!J93","v":"7AW200098"},{"$f":" WINEP_Inputs!K93","v":"Odell STW"},{"$f":"WINEP_Inputs!CW93","v":"£m"},{"$f":"WINEP_Inputs!CX93","v":1},null,{"$f":" WINEP_Inputs!CR93","v":1.867},{"$f":" WINEP_Inputs!CS93","v":1},{"$f":" WINEP_Inputs!CT93","v":1},{"$f":" WINEP_Inputs!CU93","v":1},{"$f":" WINEP_Inputs!CV93","v":"WWN"},1]
[null,null,{"$f":" WINEP_Inputs!A94","v":"EAN00516"},{"$f":" WINEP_Inputs!J94","v":"7AW200099"},{"$f":" WINEP_Inputs!K94","v":"Oldhurst STW"},{"$f":"WINEP_Inputs!CW94","v":"£m"},{"$f":"WINEP_Inputs!CX94","v":1},null,{"$f":" WINEP_Inputs!CR94","v":1.821},{"$f":" WINEP_Inputs!CS94","v":1},{"$f":" WINEP_Inputs!CT94","v":1},{"$f":" WINEP_Inputs!CU94","v":1},{"$f":" WINEP_Inputs!CV94","v":"WWN"},1]
[null,null,{"$f":" WINEP_Inputs!A95","v":"EAN00517"},{"$f":" WINEP_Inputs!J95","v":"7AW200100"},{"$f":" WINEP_Inputs!K95","v":"Olney STW"},{"$f":"WINEP_Inputs!CW95","v":"£m"},{"$f":"WINEP_Inputs!CX95","v":1},null,{"$f":" WINEP_Inputs!CR95","v":0.09},{"$f":" WINEP_Inputs!CS95","v":1},{"$f":" WINEP_Inputs!CT95","v":1},{"$f":" WINEP_Inputs!CU95","v":1},{"$f":" WINEP_Inputs!CV95","v":"WWN"},1]
[null,null,{"$f":" WINEP_Inputs!A96","v":"EAN00520"},{"$f":" WINEP_Inputs!J96","v":"7AW200103"},{"$f":" WINEP_Inputs!K96","v":"Papworth Everard STW"},{"$f":"WINEP_Inputs!CW96","v":"£m"},{"$f":"WINEP_Inputs!CX96","v":1},null,{"$f":" WINEP_Inputs!CR96","v":4.7E-2},{"$f":" WINEP_Inputs!CS96","v":1},{"$f":" WINEP_Inputs!CT96","v":1},{"$f":" WINEP_Inputs!CU96","v":1},{"$f":" WINEP_Inputs!CV96","v":"WWN"},1]
[null,null,{"$f":" WINEP_Inputs!A97","v":"EAN00522"},{"$f":" WINEP_Inputs!J97","v":"7AW200105"},{"$f":" WINEP_Inputs!K97","v":"Quendon STW"},{"$f":"WINEP_Inputs!CW97","v":"£m"},{"$f":"WINEP_Inputs!CX97","v":1},null,{"$f":" WINEP_Inputs!CR97","v":0.157},{"$f":" WINEP_Inputs!CS97","v":1},{"$f":" WINEP_Inputs!CT97","v":1},{"$f":" WINEP_Inputs!CU97","v":1},{"$f":" WINEP_Inputs!CV97","v":"WWN"},1]
[null,null,{"$f":" WINEP_Inputs!A98","v":"EAN00526"},{"$f":" WINEP_Inputs!J98","v":"7AW200109"},{"$f":" WINEP_Inputs!K98","v":"Shudy Camps STW"},{"$f":"WINEP_Inputs!CW98","v":"£m"},{"$f":"WINEP_Inputs!CX98","v":1},null,{"$f":" WINEP_Inputs!CR98","v":0.22500000000000001},{"$f":" WINEP_Inputs!CS98","v":1},{"$f":" WINEP_Inputs!CT98","v":1},{"$f":" WINEP_Inputs!CU98","v":1},{"$f":" WINEP_Inputs!CV98","v":"WWN"},1]
[null,null,{"$f":" WINEP_Inputs!A99","v":"EAN00527"},{"$f":" WINEP_Inputs!J99","v":"7AW200110"},{"$f":" WINEP_Inputs!K99","v":"Silverstone STW"},{"$f":"WINEP_Inputs!CW99","v":"£m"},{"$f":"WINEP_Inputs!CX99","v":1},null,{"$f":" WINEP_Inputs!CR99","v":3.0259999999999998},{"$f":" WINEP_Inputs!CS99","v":1},{"$f":" WINEP_Inputs!CT99","v":1},{"$f":" WINEP_Inputs!CU99","v":1},{"$f":" WINEP_Inputs!CV99","v":"WWN"},1]
[null,null,{"$f":" WINEP_Inputs!A100","v":"EAN00529"},{"$f":" WINEP_Inputs!J100","v":"7AW200112"},{"$f":" WINEP_Inputs!K100","v":"Somersham (Cambs) STW"},{"$f":"WINEP_Inputs!CW100","v":"£m"},{"$f":"WINEP_Inputs!CX100","v":1},null,{"$f":" WINEP_Inputs!CR100","v":1.7569999999999999},{"$f":" WINEP_Inputs!CS100","v":1},{"$f":" WINEP_Inputs!CT100","v":1},{"$f":" WINEP_Inputs!CU100","v":1},{"$f":" WINEP_Inputs!CV100","v":"WWN"},1]
[null,null,{"$f":" WINEP_Inputs!A101","v":"EAN00533"},{"$f":" WINEP_Inputs!J101","v":"7AW200116"},{"$f":" WINEP_Inputs!K101","v":"Stoke Goldington STW"},{"$f":"WINEP_Inputs!CW101","v":"£m"},{"$f":"WINEP_Inputs!CX101","v":1},null,{"$f":" WINEP_Inputs!CR101","v":0.22500000000000001},{"$f":" WINEP_Inputs!CS101","v":1},{"$f":" WINEP_Inputs!CT101","v":1},{"$f":" WINEP_Inputs!CU101","v":1},{"$f":" WINEP_Inputs!CV101","v":"WWN"},1]
[null,null,{"$f":" WINEP_Inputs!A102","v":"EAN00535"},{"$f":" WINEP_Inputs!J102","v":"7AW200118"},{"$f":" WINEP_Inputs!K102","v":"Syresham STW"},{"$f":"WINEP_Inputs!CW102","v":"£m"},{"$f":"WINEP_Inputs!CX102","v":1},null,{"$f":" WINEP_Inputs!CR102","v":1.718},{"$f":" WINEP_Inputs!CS102","v":1},{"$f":" WINEP_Inputs!CT102","v":1},{"$f":" WINEP_Inputs!CU102","v":1},{"$f":" WINEP_Inputs!CV102","v":"WWN"},1]
[null,null,{"$f":" WINEP_Inputs!A103","v":"EAN00536"},{"$f":" WINEP_Inputs!J103","v":"7AW200119"},{"$f":" WINEP_Inputs!K103","v":"Thurleigh STW"},{"$f":"WINEP_Inputs!CW103","v":"£m"},{"$f":"WINEP_Inputs!CX103","v":1},null,{"$f":" WINEP_Inputs!CR103","v":1.915},{"$f":" WINEP_Inputs!CS103","v":1},{"$f":" WINEP_Inputs!CT103","v":1},{"$f":" WINEP_Inputs!CU103","v":1},{"$f":" WINEP_Inputs!CV103","v":"WWN"},1]
[null,null,{"$f":" WINEP_Inputs!A104","v":"EAN00537"},{"$f":" WINEP_Inputs!J104","v":"7AW200120"},{"$f":" WINEP_Inputs!K104","v":"Thurston STW"},{"$f":"WINEP_Inputs!CW104","v":"£m"},{"$f":"WINEP_Inputs!CX104","v":1},null,{"$f":" WINEP_Inputs!CR104","v":4.4109999999999996},{"$f":" WINEP_Inputs!CS104","v":1},{"$f":" WINEP_Inputs!CT104","v":1},{"$f":" WINEP_Inputs!CU104","v":1},{"$f":" WINEP_Inputs!CV104","v":"WWN"},1]
[null,null,{"$f":" WINEP_Inputs!A105","v":"EAN00538"},{"$f":" WINEP_Inputs!J105","v":"7AW200121"},{"$f":" WINEP_Inputs!K105","v":"Tiffield STW"},{"$f":"WINEP_Inputs!CW105","v":"£m"},{"$f":"WINEP_Inputs!CX105","v":1},null,{"$f":" WINEP_Inputs!CR105","v":2.278},{"$f":" WINEP_Inputs!CS105","v":1},{"$f":" WINEP_Inputs!CT105","v":1},{"$f":" WINEP_Inputs!CU105","v":1},{"$f":" WINEP_Inputs!CV105","v":"WWN"},1]
[null,null,{"$f":" WINEP_Inputs!A106","v":"EAN00539"},{"$f":" WINEP_Inputs!J106","v":"7AW200122"},{"$f":" WINEP_Inputs!K106","v":"Towcester STW"},{"$f":"WINEP_Inputs!CW106","v":"£m"},{"$f":"WINEP_Inputs!CX106","v":1},null,{"$f":" WINEP_Inputs!CR106","v":4.282},{"$f":" WINEP_Inputs!CS106","v":1},{"$f":" WINEP_Inputs!CT106","v":1},{"$f":" WINEP_Inputs!CU106","v":1},{"$f":" WINEP_Inputs!CV106","v":"WWN"},1]
[null,null,{"$f":" WINEP_Inputs!A107","v":"EAN00540"},{"$f":" WINEP_Inputs!J107","v":"7AW200123"},{"$f":" WINEP_Inputs!K107","v":"Tuddenham (Bury St Edmunds) STW"},{"$f":"WINEP_Inputs!CW107","v":"£m"},{"$f":"WINEP_Inputs!CX107","v":1},null,{"$f":" WINEP_Inputs!CR107","v":1.9219999999999999},{"$f":" WINEP_Inputs!CS107","v":1},{"$f":" WINEP_Inputs!CT107","v":1},{"$f":" WINEP_Inputs!CU107","v":1},{"$f":" WINEP_Inputs!CV107","v":"WWN"},1]
[null,null,{"$f":" WINEP_Inputs!A108","v":"EAN00542"},{"$f":" WINEP_Inputs!J108","v":"7AW200125"},{"$f":" WINEP_Inputs!K108","v":"Waresley STW"},{"$f":"WINEP_Inputs!CW108","v":0},{"$f":"WINEP_Inputs!CX108","v":0},null,{"$f":" WINEP_Inputs!CR108","v":0},{"$f":" WINEP_Inputs!CS108","v":0},{"$f":" WINEP_Inputs!CT108","v":0},{"$f":" WINEP_Inputs!CU108","v":0},{"$f":" WINEP_Inputs!CV108","v":0},0]
[null,null,{"$f":" WINEP_Inputs!A109","v":"EAN00544"},{"$f":" WINEP_Inputs!J109","v":"7AW200127"},{"$f":" WINEP_Inputs!K109","v":"Whaddon STW"},{"$f":"WINEP_Inputs!CW109","v":"£m"},{"$f":"WINEP_Inputs!CX109","v":1},null,{"$f":" WINEP_Inputs!CR109","v":3.5880000000000001},{"$f":" WINEP_Inputs!CS109","v":1},{"$f":" WINEP_Inputs!CT109","v":1},{"$f":" WINEP_Inputs!CU109","v":1},{"$f":" WINEP_Inputs!CV109","v":"WWN"},1]
[null,null,{"$f":" WINEP_Inputs!A110","v":"EAN00565"},{"$f":" WINEP_Inputs!J110","v":"7AW200143"},{"$f":" WINEP_Inputs!K110","v":"Benhall (Saxmundham) STW"},{"$f":"WINEP_Inputs!CW110","v":"£m"},{"$f":"WINEP_Inputs!CX110","v":1},null,{"$f":" WINEP_Inputs!CR110","v":1.871},{"$f":" WINEP_Inputs!CS110","v":1},{"$f":" WINEP_Inputs!CT110","v":1},{"$f":" WINEP_Inputs!CU110","v":1},{"$f":" WINEP_Inputs!CV110","v":"WWN"},1]
[null,null,{"$f":" WINEP_Inputs!A111","v":"EAN00566"},{"$f":" WINEP_Inputs!J111","v":"7AW200144"},{"$f":" WINEP_Inputs!K111","v":"Framlingham STW"},{"$f":"WINEP_Inputs!CW111","v":"£m"},{"$f":"WINEP_Inputs!CX111","v":1},null,{"$f":" WINEP_Inputs!CR111","v":2.2490000000000001},{"$f":" WINEP_Inputs!CS111","v":1},{"$f":" WINEP_Inputs!CT111","v":1},{"$f":" WINEP_Inputs!CU111","v":1},{"$f":" WINEP_Inputs!CV111","v":"WWN"},1]
[null,null,{"$f":" WINEP_Inputs!A112","v":"EAN00567"},{"$f":" WINEP_Inputs!J112","v":"7AW200145"},{"$f":" WINEP_Inputs!K112","v":"Halesworth STW"},{"$f":"WINEP_Inputs!CW112","v":"£m"},{"$f":"WINEP_Inputs!CX112","v":1},null,{"$f":" WINEP_Inputs!CR112","v":0.71299999999999997},{"$f":" WINEP_Inputs!CS112","v":1},{"$f":" WINEP_Inputs!CT112","v":1},{"$f":" WINEP_Inputs!CU112","v":1},{"$f":" WINEP_Inputs!CV112","v":"WWN"},1]
[null,null,{"$f":" WINEP_Inputs!A113","v":"EAN00569"},{"$f":" WINEP_Inputs!J113","v":"7AW200147"},{"$f":" WINEP_Inputs!K113","v":"Wenhaston STW"},{"$f":"WINEP_Inputs!CW113","v":"£m"},{"$f":"WINEP_Inputs!CX113","v":1},null,{"$f":" WINEP_Inputs!CR113","v":2.78},{"$f":" WINEP_Inputs!CS113","v":1},{"$f":" WINEP_Inputs!CT113","v":1},{"$f":" WINEP_Inputs!CU113","v":1},{"$f":" WINEP_Inputs!CV113","v":"WWN"},1]
[null,null,{"$f":" WINEP_Inputs!A114","v":"EAN00573"},{"$f":" WINEP_Inputs!J114","v":"7AW200151"},{"$f":" WINEP_Inputs!K114","v":"Rayleigh East STW (CIP2 T1)"},{"$f":"WINEP_Inputs!CW114","v":"£m"},{"$f":"WINEP_Inputs!CX114","v":1},null,{"$f":" WINEP_Inputs!CR114","v":5.4450000000000003},{"$f":" WINEP_Inputs!CS114","v":1},{"$f":" WINEP_Inputs!CT114","v":1},{"$f":" WINEP_Inputs!CU114","v":1},{"$f":" WINEP_Inputs!CV114","v":"WWN"},1]
[null,null,{"$f":" WINEP_Inputs!A115","v":"EAN00586"},{"$f":" WINEP_Inputs!J115","v":"7AW200164"},{"$f":" WINEP_Inputs!K115","v":"Alconbury STW"},{"$f":"WINEP_Inputs!CW115","v":"£m"},{"$f":"WINEP_Inputs!CX115","v":1},null,{"$f":" WINEP_Inputs!CR115","v":2.9390000000000001},{"$f":" WINEP_Inputs!CS115","v":1},{"$f":" WINEP_Inputs!CT115","v":1},{"$f":" WINEP_Inputs!CU115","v":1},{"$f":" WINEP_Inputs!CV115","v":"WWN"},1]
[null,null,{"$f":" WINEP_Inputs!A116","v":"EAN00588"},{"$f":" WINEP_Inputs!J116","v":"7AW200166"},{"$f":" WINEP_Inputs!K116","v":"Bolnhurst STW"},{"$f":"WINEP_Inputs!CW116","v":"£m"},{"$f":"WINEP_Inputs!CX116","v":1},null,{"$f":" WINEP_Inputs!CR116","v":2.3929999999999998},{"$f":" WINEP_Inputs!CS116","v":1},{"$f":" WINEP_Inputs!CT116","v":1},{"$f":" WINEP_Inputs!CU116","v":1},{"$f":" WINEP_Inputs!CV116","v":"WWN"},1]
[null,null,{"$f":" WINEP_Inputs!A117","v":"EAN00589"},{"$f":" WINEP_Inputs!J117","v":"7AW200167"},{"$f":" WINEP_Inputs!K117","v":"Dunton STW"},{"$f":"WINEP_Inputs!CW117","v":"£m"},{"$f":"WINEP_Inputs!CX117","v":1},null,{"$f":" WINEP_Inputs!CR117","v":0.222},{"$f":" WINEP_Inputs!CS117","v":1},{"$f":" WINEP_Inputs!CT117","v":1},{"$f":" WINEP_Inputs!CU117","v":1},{"$f":" WINEP_Inputs!CV117","v":"WWN"},1]
[null,null,{"$f":" WINEP_Inputs!A118","v":"EAN00590"},{"$f":" WINEP_Inputs!J118","v":"7AW200168"},{"$f":" WINEP_Inputs!K118","v":"East Harling STW"},{"$f":"WINEP_Inputs!CW118","v":0},{"$f":"WINEP_Inputs!CX118","v":0},null,{"$f":" WINEP_Inputs!CR118","v":0},{"$f":" WINEP_Inputs!CS118","v":0},{"$f":" WINEP_Inputs!CT118","v":0},{"$f":" WINEP_Inputs!CU118","v":0},{"$f":" WINEP_Inputs!CV118","v":0},0]
[null,null,{"$f":" WINEP_Inputs!A119","v":"EAN00591"},{"$f":" WINEP_Inputs!J119","v":"7AW200169"},{"$f":" WINEP_Inputs!K119","v":"Ely (New) STW"},{"$f":"WINEP_Inputs!CW119","v":"£m"},{"$f":"WINEP_Inputs!CX119","v":1},null,{"$f":" WINEP_Inputs!CR119","v":1.1040000000000001},{"$f":" WINEP_Inputs!CS119","v":1},{"$f":" WINEP_Inputs!CT119","v":1},{"$f":" WINEP_Inputs!CU119","v":1},{"$f":" WINEP_Inputs!CV119","v":"WWN"},1]
[null,null,{"$f":" WINEP_Inputs!A120","v":"EAN00592"},{"$f":" WINEP_Inputs!J120","v":"7AW200170"},{"$f":" WINEP_Inputs!K120","v":"Ely STW"},{"$f":"WINEP_Inputs!CW120","v":"£m"},{"$f":"WINEP_Inputs!CX120","v":1},null,{"$f":" WINEP_Inputs!CR120","v":1.998},{"$f":" WINEP_Inputs!CS120","v":1},{"$f":" WINEP_Inputs!CT120","v":1},{"$f":" WINEP_Inputs!CU120","v":1},{"$f":" WINEP_Inputs!CV120","v":"WWN"},1]
[null,null,{"$f":" WINEP_Inputs!A121","v":"EAN00594"},{"$f":" WINEP_Inputs!J121","v":"7AW200172"},{"$f":" WINEP_Inputs!K121","v":"Great Ellingham STW"},{"$f":"WINEP_Inputs!CW121","v":"£m"},{"$f":"WINEP_Inputs!CX121","v":1},null,{"$f":" WINEP_Inputs!CR121","v":0.22500000000000001},{"$f":" WINEP_Inputs!CS121","v":1},{"$f":" WINEP_Inputs!CT121","v":1},{"$f":" WINEP_Inputs!CU121","v":1},{"$f":" WINEP_Inputs!CV121","v":"WWN"},1]
[null,null,{"$f":" WINEP_Inputs!A122","v":"EAN00595"},{"$f":" WINEP_Inputs!J122","v":"7AW200173"},{"$f":" WINEP_Inputs!K122","v":"Great Gidding STW"},{"$f":"WINEP_Inputs!CW122","v":"£m"},{"$f":"WINEP_Inputs!CX122","v":1},null,{"$f":" WINEP_Inputs!CR122","v":1.478},{"$f":" WINEP_Inputs!CS122","v":1},{"$f":" WINEP_Inputs!CT122","v":1},{"$f":" WINEP_Inputs!CU122","v":1},{"$f":" WINEP_Inputs!CV122","v":"WWN"},1]
[null,null,{"$f":" WINEP_Inputs!A123","v":"EAN00597"},{"$f":" WINEP_Inputs!J123","v":"7AW200175"},{"$f":" WINEP_Inputs!K123","v":"Helmdon STW"},{"$f":"WINEP_Inputs!CW123","v":"£m"},{"$f":"WINEP_Inputs!CX123","v":1},null,{"$f":" WINEP_Inputs!CR123","v":0.84899999999999998},{"$f":" WINEP_Inputs!CS123","v":1},{"$f":" WINEP_Inputs!CT123","v":1},{"$f":" WINEP_Inputs!CU123","v":1},{"$f":" WINEP_Inputs!CV123","v":"WWN"},1]
[null,null,{"$f":" WINEP_Inputs!A124","v":"EAN00598"},{"$f":" WINEP_Inputs!J124","v":"7AW200176"},{"$f":" WINEP_Inputs!K124","v":"Marston Moretaine STW"},{"$f":"WINEP_Inputs!CW124","v":"£m"},{"$f":"WINEP_Inputs!CX124","v":1},null,{"$f":" WINEP_Inputs!CR124","v":1.8440000000000001},{"$f":" WINEP_Inputs!CS124","v":1},{"$f":" WINEP_Inputs!CT124","v":1},{"$f":" WINEP_Inputs!CU124","v":1},{"$f":" WINEP_Inputs!CV124","v":"WWN"},1]
[null,null,{"$f":" WINEP_Inputs!A125","v":"EAN00600"},{"$f":" WINEP_Inputs!J125","v":"7AW200178"},{"$f":" WINEP_Inputs!K125","v":"Old Buckenham STW"},{"$f":"WINEP_Inputs!CW125","v":"£m"},{"$f":"WINEP_Inputs!CX125","v":1},null,{"$f":" WINEP_Inputs!CR125","v":0.09},{"$f":" WINEP_Inputs!CS125","v":1},{"$f":" WINEP_Inputs!CT125","v":1},{"$f":" WINEP_Inputs!CU125","v":1},{"$f":" WINEP_Inputs!CV125","v":"WWN"},1]
[null,null,{"$f":" WINEP_Inputs!A126","v":"EAN00601"},{"$f":" WINEP_Inputs!J126","v":"7AW200179"},{"$f":" WINEP_Inputs!K126","v":"Old Weston STW"},{"$f":"WINEP_Inputs!CW126","v":"£m"},{"$f":"WINEP_Inputs!CX126","v":1},null,{"$f":" WINEP_Inputs!CR126","v":1.254},{"$f":" WINEP_Inputs!CS126","v":1},{"$f":" WINEP_Inputs!CT126","v":1},{"$f":" WINEP_Inputs!CU126","v":1},{"$f":" WINEP_Inputs!CV126","v":"WWN"},1]
[null,null,{"$f":" WINEP_Inputs!A127","v":"EAN00604"},{"$f":" WINEP_Inputs!J127","v":"7AW200182"},{"$f":" WINEP_Inputs!K127","v":"Thetford STW"},{"$f":"WINEP_Inputs!CW127","v":"£m"},{"$f":"WINEP_Inputs!CX127","v":1},null,{"$f":" WINEP_Inputs!CR127","v":0.38700000000000001},{"$f":" WINEP_Inputs!CS127","v":1},{"$f":" WINEP_Inputs!CT127","v":1},{"$f":" WINEP_Inputs!CU127","v":1},{"$f":" WINEP_Inputs!CV127","v":"WWN"},1]
[null,null,{"$f":" WINEP_Inputs!A128","v":"EAN00623"},{"$f":" WINEP_Inputs!J128","v":"7AW200201"},{"$f":" WINEP_Inputs!K128","v":"Debenham STW"},{"$f":"WINEP_Inputs!CW128","v":"£m"},{"$f":"WINEP_Inputs!CX128","v":1},null,{"$f":" WINEP_Inputs!CR128","v":0.65200000000000002},{"$f":" WINEP_Inputs!CS128","v":1},{"$f":" WINEP_Inputs!CT128","v":1},{"$f":" WINEP_Inputs!CU128","v":1},{"$f":" WINEP_Inputs!CV128","v":"WWN"},1]
[null,null,{"$f":" WINEP_Inputs!A129","v":"EAN00624"},{"$f":" WINEP_Inputs!J129","v":"7AW200202"},{"$f":" WINEP_Inputs!K129","v":"Earl Soham STW"},{"$f":"WINEP_Inputs!CW129","v":"£m"},{"$f":"WINEP_Inputs!CX129","v":1},null,{"$f":" WINEP_Inputs!CR129","v":1.335},{"$f":" WINEP_Inputs!CS129","v":1},{"$f":" WINEP_Inputs!CT129","v":1},{"$f":" WINEP_Inputs!CU129","v":1},{"$f":" WINEP_Inputs!CV129","v":"WWN"},1]
[null,null,{"$f":" WINEP_Inputs!A130","v":"EAN00628"},{"$f":" WINEP_Inputs!J130","v":"7AW200206"},{"$f":" WINEP_Inputs!K130","v":"Rendlesham Park STW"},{"$f":"WINEP_Inputs!CW130","v":"£m"},{"$f":"WINEP_Inputs!CX130","v":1},null,{"$f":" WINEP_Inputs!CR130","v":0.09},{"$f":" WINEP_Inputs!CS130","v":1},{"$f":" WINEP_Inputs!CT130","v":1},{"$f":" WINEP_Inputs!CU130","v":1},{"$f":" WINEP_Inputs!CV130","v":"WWN"},1]
[null,null,{"$f":" WINEP_Inputs!A131","v":"EAN00629"},{"$f":" WINEP_Inputs!J131","v":"7AW200207"},{"$f":" WINEP_Inputs!K131","v":"Wickham Market STW"},{"$f":"WINEP_Inputs!CW131","v":"£m"},{"$f":"WINEP_Inputs!CX131","v":1},null,{"$f":" WINEP_Inputs!CR131","v":0.63700000000000001},{"$f":" WINEP_Inputs!CS131","v":1},{"$f":" WINEP_Inputs!CT131","v":1},{"$f":" WINEP_Inputs!CU131","v":1},{"$f":" WINEP_Inputs!CV131","v":"WWN"},1]
[null,null,{"$f":" WINEP_Inputs!A132","v":"EAN00630"},{"$f":" WINEP_Inputs!J132","v":"7AW200208"},{"$f":" WINEP_Inputs!K132","v":"Earls Colne STW"},{"$f":"WINEP_Inputs!CW132","v":"£m"},{"$f":"WINEP_Inputs!CX132","v":1},null,{"$f":" WINEP_Inputs!CR132","v":2.085},{"$f":" WINEP_Inputs!CS132","v":1},{"$f":" WINEP_Inputs!CT132","v":1},{"$f":" WINEP_Inputs!CU132","v":1},{"$f":" WINEP_Inputs!CV132","v":"WWN"},1]
[null,null,{"$f":" WINEP_Inputs!A133","v":"EAN00631"},{"$f":" WINEP_Inputs!J133","v":"7AW200209"},{"$f":" WINEP_Inputs!K133","v":"Ridgewell STW"},{"$f":"WINEP_Inputs!CW133","v":"£m"},{"$f":"WINEP_Inputs!CX133","v":1},null,{"$f":" WINEP_Inputs!CR133","v":0.157},{"$f":" WINEP_Inputs!CS133","v":1},{"$f":" WINEP_Inputs!CT133","v":1},{"$f":" WINEP_Inputs!CU133","v":1},{"$f":" WINEP_Inputs!CV133","v":"WWN"},1]
[null,null,{"$f":" WINEP_Inputs!A134","v":"EAN00632"},{"$f":" WINEP_Inputs!J134","v":"7AW200210"},{"$f":" WINEP_Inputs!K134","v":"Stambourne STW"},{"$f":"WINEP_Inputs!CW134","v":"£m"},{"$f":"WINEP_Inputs!CX134","v":1},null,{"$f":" WINEP_Inputs!CR134","v":2.343},{"$f":" WINEP_Inputs!CS134","v":1},{"$f":" WINEP_Inputs!CT134","v":1},{"$f":" WINEP_Inputs!CU134","v":1},{"$f":" WINEP_Inputs!CV134","v":"WWN"},1]
[null,null,{"$f":" WINEP_Inputs!A135","v":"EAN00633"},{"$f":" WINEP_Inputs!J135","v":"7AW200211"},{"$f":" WINEP_Inputs!K135","v":"West Bergholt STW"},{"$f":"WINEP_Inputs!CW135","v":"£m"},{"$f":"WINEP_Inputs!CX135","v":1},null,{"$f":" WINEP_Inputs!CR135","v":2.06},{"$f":" WINEP_Inputs!CS135","v":1},{"$f":" WINEP_Inputs!CT135","v":1},{"$f":" WINEP_Inputs!CU135","v":1},{"$f":" WINEP_Inputs!CV135","v":"WWN"},1]
[null,null,{"$f":" WINEP_Inputs!A136","v":"EAN00634"},{"$f":" WINEP_Inputs!J136","v":"7AW200212"},{"$f":" WINEP_Inputs!K136","v":"Eight Ash Green STW"},{"$f":"WINEP_Inputs!CW136","v":"£m"},{"$f":"WINEP_Inputs!CX136","v":1},null,{"$f":" WINEP_Inputs!CR136","v":1.93},{"$f":" WINEP_Inputs!CS136","v":1},{"$f":" WINEP_Inputs!CT136","v":1},{"$f":" WINEP_Inputs!CU136","v":1},{"$f":" WINEP_Inputs!CV136","v":"WWN"},1]
[null,null,{"$f":" WINEP_Inputs!A137","v":"EAN00635"},{"$f":" WINEP_Inputs!J137","v":"7AW200213"},{"$f":" WINEP_Inputs!K137","v":"Gosfield STW"},{"$f":"WINEP_Inputs!CW137","v":"£m"},{"$f":"WINEP_Inputs!CX137","v":1},null,{"$f":" WINEP_Inputs!CR137","v":2.8559999999999999},{"$f":" WINEP_Inputs!CS137","v":1},{"$f":" WINEP_Inputs!CT137","v":1},{"$f":" WINEP_Inputs!CU137","v":1},{"$f":" WINEP_Inputs!CV137","v":"WWN"},1]
[null,null,{"$f":" WINEP_Inputs!A138","v":"EAN00636"},{"$f":" WINEP_Inputs!J138","v":"7AW200214"},{"$f":" WINEP_Inputs!K138","v":"Great Bromley STW"},{"$f":"WINEP_Inputs!CW138","v":"£m"},{"$f":"WINEP_Inputs!CX138","v":1},null,{"$f":" WINEP_Inputs!CR138","v":2.9340000000000002},{"$f":" WINEP_Inputs!CS138","v":1},{"$f":" WINEP_Inputs!CT138","v":1},{"$f":" WINEP_Inputs!CU138","v":1},{"$f":" WINEP_Inputs!CV138","v":"WWN"},1]
[null,null,{"$f":" WINEP_Inputs!A139","v":"EAN00637"},{"$f":" WINEP_Inputs!J139","v":"7AW200215"},{"$f":" WINEP_Inputs!K139","v":"Halstead (Langley) STW"},{"$f":"WINEP_Inputs!CW139","v":0},{"$f":"WINEP_Inputs!CX139","v":0},null,{"$f":" WINEP_Inputs!CR139","v":0},{"$f":" WINEP_Inputs!CS139","v":0},{"$f":" WINEP_Inputs!CT139","v":0},{"$f":" WINEP_Inputs!CU139","v":0},{"$f":" WINEP_Inputs!CV139","v":0},{"$f":" IF(K144 = 0, 0, K144 / J144)","v":0}]
[null,null,{"$f":" WINEP_Inputs!A140","v":"EAN00638"},{"$f":" WINEP_Inputs!J140","v":"7AW200216"},{"$f":" WINEP_Inputs!K140","v":"Sible Hedingham STW"},{"$f":"WINEP_Inputs!CW140","v":"£m"},{"$f":"WINEP_Inputs!CX140","v":1},null,{"$f":" WINEP_Inputs!CR140","v":3.8159999999999998},{"$f":" WINEP_Inputs!CS140","v":1},{"$f":" WINEP_Inputs!CT140","v":1},{"$f":" WINEP_Inputs!CU140","v":1},{"$f":" WINEP_Inputs!CV140","v":"WWN"},1]
[null,null,{"$f":" WINEP_Inputs!A141","v":"EAN00639"},{"$f":" WINEP_Inputs!J141","v":"7AW200217"},{"$f":" WINEP_Inputs!K141","v":"Thorrington STW"},{"$f":"WINEP_Inputs!CW141","v":"£m"},{"$f":"WINEP_Inputs!CX141","v":1},null,{"$f":" WINEP_Inputs!CR141","v":3.528},{"$f":" WINEP_Inputs!CS141","v":1},{"$f":" WINEP_Inputs!CT141","v":1},{"$f":" WINEP_Inputs!CU141","v":1},{"$f":" WINEP_Inputs!CV141","v":"WWN"},1]
[null,null,{"$f":" WINEP_Inputs!A142","v":"EAN00650"},{"$f":" WINEP_Inputs!J142","v":"7AW200228"},{"$f":" WINEP_Inputs!K142","v":"Sisland (Loddon) STW"},{"$f":"WINEP_Inputs!CW142","v":"£m"},{"$f":"WINEP_Inputs!CX142","v":1},null,{"$f":" WINEP_Inputs!CR142","v":1.97},{"$f":" WINEP_Inputs!CS142","v":1},{"$f":" WINEP_Inputs!CT142","v":1},{"$f":" WINEP_Inputs!CU142","v":1},{"$f":" WINEP_Inputs!CV142","v":"WWN"},1]
[null,null,{"$f":" WINEP_Inputs!A143","v":"EAN00651"},{"$f":" WINEP_Inputs!J143","v":"7AW200229"},{"$f":" WINEP_Inputs!K143","v":"Swardeston STW"},{"$f":"WINEP_Inputs!CW143","v":0},{"$f":"WINEP_Inputs!CX143","v":0},null,{"$f":" WINEP_Inputs!CR143","v":0},{"$f":" WINEP_Inputs!CS143","v":0},{"$f":" WINEP_Inputs!CT143","v":0},{"$f":" WINEP_Inputs!CU143","v":0},{"$f":" WINEP_Inputs!CV143","v":0},0]
[null,null,{"$f":" WINEP_Inputs!A144","v":"EAN00663"},{"$f":" WINEP_Inputs!J144","v":"7AW200241"},{"$f":" WINEP_Inputs!K144","v":"Billericay (Outwood) STW"},{"$f":"WINEP_Inputs!CW144","v":0},{"$f":"WINEP_Inputs!CX144","v":0},null,{"$f":" WINEP_Inputs!CR144","v":0},{"$f":" WINEP_Inputs!CS144","v":0},{"$f":" WINEP_Inputs!CT144","v":0},{"$f":" WINEP_Inputs!CU144","v":0},{"$f":" WINEP_Inputs!CV144","v":0},0]
[null,null,{"$f":" WINEP_Inputs!A145","v":"EAN00685"},{"$f":" WINEP_Inputs!J145","v":"7AW200263"},{"$f":" WINEP_Inputs!K145","v":"Mablethorpe STW"},{"$f":"WINEP_Inputs!CW145","v":0},{"$f":"WINEP_Inputs!CX145","v":0},null,{"$f":" WINEP_Inputs!CR145","v":0},{"$f":" WINEP_Inputs!CS145","v":0},{"$f":" WINEP_Inputs!CT145","v":0},{"$f":" WINEP_Inputs!CU145","v":0},{"$f":" WINEP_Inputs!CV145","v":0},0]
[null,null,{"$f":" WINEP_Inputs!A146","v":"EAN02349"},{"$f":" WINEP_Inputs!J146","v":"7AW201925"},{"$f":" WINEP_Inputs!K146","v":"Burrough Green STW"},{"$f":"WINEP_Inputs!CW146","v":"£m"},{"$f":"WINEP_Inputs!CX146","v":1},null,{"$f":" WINEP_Inputs!CR146","v":2.351},{"$f":" WINEP_Inputs!CS146","v":1},{"$f":" WINEP_Inputs!CT146","v":1},{"$f":" WINEP_Inputs!CU146","v":1},{"$f":" WINEP_Inputs!CV146","v":"WWN"},1]
[null,null,{"$f":" WINEP_Inputs!A147","v":"EAN02350"},{"$f":" WINEP_Inputs!J147","v":"7AW201926"},{"$f":" WINEP_Inputs!K147","v":"Stradishall - Highpoint STW"},{"$f":"WINEP_Inputs!CW147","v":"£m"},{"$f":"WINEP_Inputs!CX147","v":1},null,{"$f":" WINEP_Inputs!CR147","v":2.5670000000000002},{"$f":" WINEP_Inputs!CS147","v":1},{"$f":" WINEP_Inputs!CT147","v":1},{"$f":" WINEP_Inputs!CU147","v":1},{"$f":" WINEP_Inputs!CV147","v":"WWN"},1]
[null,null,{"$f":" WINEP_Inputs!A148","v":"EAN02352"},{"$f":" WINEP_Inputs!J148","v":"7AW201928"},{"$f":" WINEP_Inputs!K148","v":"Great Cornard STW"},{"$f":"WINEP_Inputs!CW148","v":"£m"},{"$f":"WINEP_Inputs!CX148","v":1},null,{"$f":" WINEP_Inputs!CR148","v":4.157},{"$f":" WINEP_Inputs!CS148","v":1},{"$f":" WINEP_Inputs!CT148","v":1},{"$f":" WINEP_Inputs!CU148","v":1},{"$f":" WINEP_Inputs!CV148","v":"WWN"},1]
[null,null,{"$f":" WINEP_Inputs!A149","v":"EAN02353"},{"$f":" WINEP_Inputs!J149","v":"7AW201929"},{"$f":" WINEP_Inputs!K149","v":"Great Waldingfield STW"},{"$f":"WINEP_Inputs!CW149","v":"£m"},{"$f":"WINEP_Inputs!CX149","v":1},null,{"$f":" WINEP_Inputs!CR149","v":2.66},{"$f":" WINEP_Inputs!CS149","v":1},{"$f":" WINEP_Inputs!CT149","v":1},{"$f":" WINEP_Inputs!CU149","v":1},{"$f":" WINEP_Inputs!CV149","v":"WWN"},1]
[null,null,{"$f":" WINEP_Inputs!A150","v":"EAN02354"},{"$f":" WINEP_Inputs!J150","v":"7AW201930"},{"$f":" WINEP_Inputs!K150","v":"Hadleigh STW"},{"$f":"WINEP_Inputs!CW150","v":"£m"},{"$f":"WINEP_Inputs!CX150","v":1},null,{"$f":" WINEP_Inputs!CR150","v":3.2749999999999999},{"$f":" WINEP_Inputs!CS150","v":1},{"$f":" WINEP_Inputs!CT150","v":1},{"$f":" WINEP_Inputs!CU150","v":1},{"$f":" WINEP_Inputs!CV150","v":"WWN"},1]
[null,null,{"$f":" WINEP_Inputs!A151","v":"EAN02355"},{"$f":" WINEP_Inputs!J151","v":"7AW201931"},{"$f":" WINEP_Inputs!K151","v":"Haverhill STW"},{"$f":"WINEP_Inputs!CW151","v":"£m"},{"$f":"WINEP_Inputs!CX151","v":1},null,{"$f":" WINEP_Inputs!CR151","v":7.2969999999999997},{"$f":" WINEP_Inputs!CS151","v":1},{"$f":" WINEP_Inputs!CT151","v":1},{"$f":" WINEP_Inputs!CU151","v":1},{"$f":" WINEP_Inputs!CV151","v":"WWN"},1]
[null,null,{"$f":" WINEP_Inputs!A152","v":"EAN02356"},{"$f":" WINEP_Inputs!J152","v":"7AW201932"},{"$f":" WINEP_Inputs!K152","v":"Hundon STW"},{"$f":"WINEP_Inputs!CW152","v":"£m"},{"$f":"WINEP_Inputs!CX152","v":1},null,{"$f":" WINEP_Inputs!CR152","v":2.8130000000000002},{"$f":" WINEP_Inputs!CS152","v":1},{"$f":" WINEP_Inputs!CT152","v":1},{"$f":" WINEP_Inputs!CU152","v":1},{"$f":" WINEP_Inputs!CV152","v":"WWN"},1]
[null,null,{"$f":" WINEP_Inputs!A153","v":"EAN02357"},{"$f":" WINEP_Inputs!J153","v":"7AW201933"},{"$f":" WINEP_Inputs!K153","v":"Kedington STW"},{"$f":"WINEP_Inputs!CW153","v":"£m"},{"$f":"WINEP_Inputs!CX153","v":1},null,{"$f":" WINEP_Inputs!CR153","v":0.09},{"$f":" WINEP_Inputs!CS153","v":1},{"$f":" WINEP_Inputs!CT153","v":1},{"$f":" WINEP_Inputs!CU153","v":1},{"$f":" WINEP_Inputs!CV153","v":"WWN"},1]
[null,null,{"$f":" WINEP_Inputs!A154","v":"EAN02358"},{"$f":" WINEP_Inputs!J154","v":"7AW201934"},{"$f":" WINEP_Inputs!K154","v":"Langham (Essex) STW"},{"$f":"WINEP_Inputs!CW154","v":"£m"},{"$f":"WINEP_Inputs!CX154","v":1},null,{"$f":" WINEP_Inputs!CR154","v":0.97599999999999998},{"$f":" WINEP_Inputs!CS154","v":1},{"$f":" WINEP_Inputs!CT154","v":1},{"$f":" WINEP_Inputs!CU154","v":1},{"$f":" WINEP_Inputs!CV154","v":"WWN"},1]
[null,null,{"$f":" WINEP_Inputs!A155","v":"EAN02360"},{"$f":" WINEP_Inputs!J155","v":"7AW201936"},{"$f":" WINEP_Inputs!K155","v":"Steeple Bumpstead STW"},{"$f":"WINEP_Inputs!CW155","v":"£m"},{"$f":"WINEP_Inputs!CX155","v":1},null,{"$f":" WINEP_Inputs!CR155","v":1.8380000000000001},{"$f":" WINEP_Inputs!CS155","v":1},{"$f":" WINEP_Inputs!CT155","v":1},{"$f":" WINEP_Inputs!CU155","v":1},{"$f":" WINEP_Inputs!CV155","v":"WWN"},1]
[null,null,{"$f":" WINEP_Inputs!A156","v":"EAN02361"},{"$f":" WINEP_Inputs!J156","v":"7AW201937"},{"$f":" WINEP_Inputs!K156","v":"Sudbury STW"},{"$f":"WINEP_Inputs!CW156","v":"£m"},{"$f":"WINEP_Inputs!CX156","v":1},null,{"$f":" WINEP_Inputs!CR156","v":1.8380000000000001},{"$f":" WINEP_Inputs!CS156","v":1},{"$f":" WINEP_Inputs!CT156","v":1},{"$f":" WINEP_Inputs!CU156","v":1},{"$f":" WINEP_Inputs!CV156","v":"WWN"},1]
[null,null,{"$f":" WINEP_Inputs!A157","v":"EAN02362"},{"$f":" WINEP_Inputs!J157","v":"7AW201938"},{"$f":" WINEP_Inputs!K157","v":"Thurlow STW"},{"$f":"WINEP_Inputs!CW157","v":"£m"},{"$f":"WINEP_Inputs!CX157","v":1},null,{"$f":" WINEP_Inputs!CR157","v":0.22500000000000001},{"$f":" WINEP_Inputs!CS157","v":1},{"$f":" WINEP_Inputs!CT157","v":1},{"$f":" WINEP_Inputs!CU157","v":1},{"$f":" WINEP_Inputs!CV157","v":"WWN"},1]
[null,null,{"$f":" WINEP_Inputs!A158","v":"EAN02363"},{"$f":" WINEP_Inputs!J158","v":"7AW201939"},{"$f":" WINEP_Inputs!K158","v":"Wickham Brook STW"},{"$f":"WINEP_Inputs!CW158","v":"£m"},{"$f":"WINEP_Inputs!CX158","v":1},null,{"$f":" WINEP_Inputs!CR158","v":1.1990000000000001},{"$f":" WINEP_Inputs!CS158","v":1},{"$f":" WINEP_Inputs!CT158","v":1},{"$f":" WINEP_Inputs!CU158","v":1},{"$f":" WINEP_Inputs!CV158","v":"WWN"},1]
[null,null,{"$f":" WINEP_Inputs!A159","v":"EAN02364"},{"$f":" WINEP_Inputs!J159","v":"7AW201940"},{"$f":" WINEP_Inputs!K159","v":"Withersfield STW"},{"$f":"WINEP_Inputs!CW159","v":"£m"},{"$f":"WINEP_Inputs!CX159","v":1},null,{"$f":" WINEP_Inputs!CR159","v":1.3680000000000001},{"$f":" WINEP_Inputs!CS159","v":1},{"$f":" WINEP_Inputs!CT159","v":1},{"$f":" WINEP_Inputs!CU159","v":1},{"$f":" WINEP_Inputs!CV159","v":"WWN"},1]
[null,null,{"$f":" WINEP_Inputs!A160","v":"LNA00049"},{"$f":" WINEP_Inputs!J160","v":"7AW201955"},{"$f":" WINEP_Inputs!K160","v":"Brixworth STW"},{"$f":"WINEP_Inputs!CW160","v":0},{"$f":"WINEP_Inputs!CX160","v":0},null,{"$f":" WINEP_Inputs!CR160","v":0},{"$f":" WINEP_Inputs!CS160","v":0},{"$f":" WINEP_Inputs!CT160","v":0},{"$f":" WINEP_Inputs!CU160","v":0},{"$f":" WINEP_Inputs!CV160","v":0},0]
[null,null,{"$f":" WINEP_Inputs!A161","v":"LNA00050"},{"$f":" WINEP_Inputs!J161","v":"7AW201956"},{"$f":" WINEP_Inputs!K161","v":"Broadholme STW"},{"$f":"WINEP_Inputs!CW161","v":0},{"$f":"WINEP_Inputs!CX161","v":0},null,{"$f":" WINEP_Inputs!CR161","v":0},{"$f":" WINEP_Inputs!CS161","v":0},{"$f":" WINEP_Inputs!CT161","v":0},{"$f":" WINEP_Inputs!CU161","v":0},{"$f":" WINEP_Inputs!CV161","v":0},0]
[null,null,{"$f":" WINEP_Inputs!A162","v":"LNA00054"},{"$f":" WINEP_Inputs!J162","v":"7AW201960"},{"$f":" WINEP_Inputs!K162","v":"Clipston STW"},{"$f":"WINEP_Inputs!CW162","v":"£m"},{"$f":"WINEP_Inputs!CX162","v":1},null,{"$f":" WINEP_Inputs!CR162","v":3.5579999999999998},{"$f":" WINEP_Inputs!CS162","v":1},{"$f":" WINEP_Inputs!CT162","v":1},{"$f":" WINEP_Inputs!CU162","v":1},{"$f":" WINEP_Inputs!CV162","v":"WWN"},1]
[null,null,{"$f":" WINEP_Inputs!A163","v":"LNA00055"},{"$f":" WINEP_Inputs!J163","v":"7AW201961"},{"$f":" WINEP_Inputs!K163","v":"Corby STW"},{"$f":"WINEP_Inputs!CW163","v":0},{"$f":"WINEP_Inputs!CX163","v":0},null,{"$f":" WINEP_Inputs!CR163","v":0},{"$f":" WINEP_Inputs!CS163","v":0},{"$f":" WINEP_Inputs!CT163","v":0},{"$f":" WINEP_Inputs!CU163","v":0},{"$f":" WINEP_Inputs!CV163","v":0},0]
[null,null,{"$f":" WINEP_Inputs!A164","v":"LNA00057"},{"$f":" WINEP_Inputs!J164","v":"7AW201963"},{"$f":" WINEP_Inputs!K164","v":"Draughton STW"},{"$f":"WINEP_Inputs!CW164","v":"£m"},{"$f":"WINEP_Inputs!CX164","v":1},null,{"$f":" WINEP_Inputs!CR164","v":3.6179999999999999},{"$f":" WINEP_Inputs!CS164","v":1},{"$f":" WINEP_Inputs!CT164","v":1},{"$f":" WINEP_Inputs!CU164","v":1},{"$f":" WINEP_Inputs!CV164","v":"WWN"},1]
[null,null,{"$f":" WINEP_Inputs!A165","v":"LNA00058"},{"$f":" WINEP_Inputs!J165","v":"7AW201964"},{"$f":" WINEP_Inputs!K165","v":"East Haddon STW"},{"$f":"WINEP_Inputs!CW165","v":"£m"},{"$f":"WINEP_Inputs!CX165","v":1},null,{"$f":" WINEP_Inputs!CR165","v":1.8580000000000001},{"$f":" WINEP_Inputs!CS165","v":1},{"$f":" WINEP_Inputs!CT165","v":1},{"$f":" WINEP_Inputs!CU165","v":1},{"$f":" WINEP_Inputs!CV165","v":"WWN"},1]
[null,null,{"$f":" WINEP_Inputs!A166","v":"LNA00060"},{"$f":" WINEP_Inputs!J166","v":"7AW201966"},{"$f":" WINEP_Inputs!K166","v":"Geddington STW"},{"$f":"WINEP_Inputs!CW166","v":"£m"},{"$f":"WINEP_Inputs!CX166","v":1},null,{"$f":" WINEP_Inputs!CR166","v":1.762},{"$f":" WINEP_Inputs!CS166","v":1},{"$f":" WINEP_Inputs!CT166","v":1},{"$f":" WINEP_Inputs!CU166","v":1},{"$f":" WINEP_Inputs!CV166","v":"WWN"},1]
[null,null,{"$f":" WINEP_Inputs!A167","v":"LNA00062"},{"$f":" WINEP_Inputs!J167","v":"7AW201968"},{"$f":" WINEP_Inputs!K167","v":"Great Oxendon STW"},{"$f":"WINEP_Inputs!CW167","v":"£m"},{"$f":"WINEP_Inputs!CX167","v":1},null,{"$f":" WINEP_Inputs!CR167","v":2.875},{"$f":" WINEP_Inputs!CS167","v":1},{"$f":" WINEP_Inputs!CT167","v":1},{"$f":" WINEP_Inputs!CU167","v":1},{"$f":" WINEP_Inputs!CV167","v":"WWN"},1]
[null,null,{"$f":" WINEP_Inputs!A168","v":"LNA00063"},{"$f":" WINEP_Inputs!J168","v":"7AW201969"},{"$f":" WINEP_Inputs!K168","v":"Hackleton STW"},{"$f":"WINEP_Inputs!CW168","v":"£m"},{"$f":"WINEP_Inputs!CX168","v":1},null,{"$f":" WINEP_Inputs!CR168","v":1.911},{"$f":" WINEP_Inputs!CS168","v":1},{"$f":" WINEP_Inputs!CT168","v":1},{"$f":" WINEP_Inputs!CU168","v":1},{"$f":" WINEP_Inputs!CV168","v":"WWN"},1]
[null,null,{"$f":" WINEP_Inputs!A169","v":"LNA00065"},{"$f":" WINEP_Inputs!J169","v":"7AW201971"},{"$f":" WINEP_Inputs!K169","v":"Hollowell STW"},{"$f":"WINEP_Inputs!CW169","v":0},{"$f":"WINEP_Inputs!CX169","v":0},null,{"$f":" WINEP_Inputs!CR169","v":0},{"$f":" WINEP_Inputs!CS169","v":0},{"$f":" WINEP_Inputs!CT169","v":0},{"$f":" WINEP_Inputs!CU169","v":0},{"$f":" WINEP_Inputs!CV169","v":0},0]
[null,null,{"$f":" WINEP_Inputs!A170","v":"LNA00074"},{"$f":" WINEP_Inputs!J170","v":"7AW201980"},{"$f":" WINEP_Inputs!K170","v":"Ravensthorpe STW"},{"$f":"WINEP_Inputs!CW170","v":"£m"},{"$f":"WINEP_Inputs!CX170","v":1},null,{"$f":" WINEP_Inputs!CR170","v":1.242},{"$f":" WINEP_Inputs!CS170","v":1},{"$f":" WINEP_Inputs!CT170","v":1},{"$f":" WINEP_Inputs!CU170","v":1},{"$f":" WINEP_Inputs!CV170","v":"WWN"},1]
[null,null,{"$f":" WINEP_Inputs!A171","v":"LNA00077"},{"$f":" WINEP_Inputs!J171","v":"7AW201983"},{"$f":" WINEP_Inputs!K171","v":"Titchmarsh STW"},{"$f":"WINEP_Inputs!CW171","v":"£m"},{"$f":"WINEP_Inputs!CX171","v":1},null,{"$f":" WINEP_Inputs!CR171","v":1.284},{"$f":" WINEP_Inputs!CS171","v":1},{"$f":" WINEP_Inputs!CT171","v":1},{"$f":" WINEP_Inputs!CU171","v":1},{"$f":" WINEP_Inputs!CV171","v":"WWN"},1]
[null,null,{"$f":" WINEP_Inputs!A172","v":"LNA00081"},{"$f":" WINEP_Inputs!J172","v":"7AW201987"},{"$f":" WINEP_Inputs!K172","v":"Wittering STW"},{"$f":"WINEP_Inputs!CW172","v":0},{"$f":"WINEP_Inputs!CX172","v":0},null,{"$f":" WINEP_Inputs!CR172","v":0},{"$f":" WINEP_Inputs!CS172","v":0},{"$f":" WINEP_Inputs!CT172","v":0},{"$f":" WINEP_Inputs!CU172","v":0},{"$f":" WINEP_Inputs!CV172","v":0},0]
[null,null,{"$f":" WINEP_Inputs!A173","v":"LNA00109"},{"$f":" WINEP_Inputs!J173","v":"7AW202005"},{"$f":" WINEP_Inputs!K173","v":"Alford STW"},{"$f":"WINEP_Inputs!CW173","v":"£m"},{"$f":"WINEP_Inputs!CX173","v":1},null,{"$f":" WINEP_Inputs!CR173","v":3.137},{"$f":" WINEP_Inputs!CS173","v":1},{"$f":" WINEP_Inputs!CT173","v":1},{"$f":" WINEP_Inputs!CU173","v":1},{"$f":" WINEP_Inputs!CV173","v":"WWN"},1]
[null,null,{"$f":" WINEP_Inputs!A174","v":"LNA00112"},{"$f":" WINEP_Inputs!J174","v":"7AW202008"},{"$f":" WINEP_Inputs!K174","v":"Anderby STW"},{"$f":"WINEP_Inputs!CW174","v":"£m"},{"$f":"WINEP_Inputs!CX174","v":1},null,{"$f":" WINEP_Inputs!CR174","v":1.2549999999999999},{"$f":" WINEP_Inputs!CS174","v":1},{"$f":" WINEP_Inputs!CT174","v":1},{"$f":" WINEP_Inputs!CU174","v":1},{"$f":" WINEP_Inputs!CV174","v":"WWN"},1]
[null,null,{"$f":" WINEP_Inputs!A175","v":"LNA00120"},{"$f":" WINEP_Inputs!J175","v":"7AW202016"},{"$f":" WINEP_Inputs!K175","v":"Caythorpe STW"},{"$f":"WINEP_Inputs!CW175","v":"£m"},{"$f":"WINEP_Inputs!CX175","v":1},null,{"$f":" WINEP_Inputs!CR175","v":2.0409999999999999},{"$f":" WINEP_Inputs!CS175","v":1},{"$f":" WINEP_Inputs!CT175","v":1},{"$f":" WINEP_Inputs!CU175","v":1},{"$f":" WINEP_Inputs!CV175","v":"WWN"},1]
[null,null,{"$f":" WINEP_Inputs!A176","v":"LNA00121"},{"$f":" WINEP_Inputs!J176","v":"7AW202017"},{"$f":" WINEP_Inputs!K176","v":"Colsterworth STW"},{"$f":"WINEP_Inputs!CW176","v":"£m"},{"$f":"WINEP_Inputs!CX176","v":1},null,{"$f":" WINEP_Inputs!CR176","v":2.0760000000000001},{"$f":" WINEP_Inputs!CS176","v":1},{"$f":" WINEP_Inputs!CT176","v":1},{"$f":" WINEP_Inputs!CU176","v":1},{"$f":" WINEP_Inputs!CV176","v":"WWN"},1]
[null,null,{"$f":" WINEP_Inputs!A177","v":"LNA00123"},{"$f":" WINEP_Inputs!J177","v":"7AW202019"},{"$f":" WINEP_Inputs!K177","v":"Corringham STW"},{"$f":"WINEP_Inputs!CW177","v":"£m"},{"$f":"WINEP_Inputs!CX177","v":1},null,{"$f":" WINEP_Inputs!CR177","v":1.5840000000000001},{"$f":" WINEP_Inputs!CS177","v":1},{"$f":" WINEP_Inputs!CT177","v":1},{"$f":" WINEP_Inputs!CU177","v":1},{"$f":" WINEP_Inputs!CV177","v":"WWN"},1]
[null,null,{"$f":" WINEP_Inputs!A178","v":"LNA00127"},{"$f":" WINEP_Inputs!J178","v":"7AW202023"},{"$f":" WINEP_Inputs!K178","v":"Dunholme STW"},{"$f":"WINEP_Inputs!CW178","v":"£m"},{"$f":"WINEP_Inputs!CX178","v":1},null,{"$f":" WINEP_Inputs!CR178","v":3.25},{"$f":" WINEP_Inputs!CS178","v":1},{"$f":" WINEP_Inputs!CT178","v":1},{"$f":" WINEP_Inputs!CU178","v":1},{"$f":" WINEP_Inputs!CV178","v":"WWN"},1]
[null,null,{"$f":" WINEP_Inputs!A179","v":"LNA00128"},{"$f":" WINEP_Inputs!J179","v":"7AW202024"},{"$f":" WINEP_Inputs!K179","v":"Dunsby STW"},{"$f":"WINEP_Inputs!CW179","v":"£m"},{"$f":"WINEP_Inputs!CX179","v":1},null,{"$f":" WINEP_Inputs!CR179","v":4.4740000000000002},{"$f":" WINEP_Inputs!CS179","v":1},{"$f":" WINEP_Inputs!CT179","v":1},{"$f":" WINEP_Inputs!CU179","v":1},{"$f":" WINEP_Inputs!CV179","v":"WWN"},1]
[null,null,{"$f":" WINEP_Inputs!A180","v":"LNA00130"},{"$f":" WINEP_Inputs!J180","v":"7AW202026"},{"$f":" WINEP_Inputs!K180","v":"Faldingworth STW"},{"$f":"WINEP_Inputs!CW180","v":"£m"},{"$f":"WINEP_Inputs!CX180","v":1},null,{"$f":" WINEP_Inputs!CR180","v":1.581},{"$f":" WINEP_Inputs!CS180","v":1},{"$f":" WINEP_Inputs!CT180","v":1},{"$f":" WINEP_Inputs!CU180","v":1},{"$f":" WINEP_Inputs!CV180","v":"WWN"},1]
[null,null,{"$f":" WINEP_Inputs!A181","v":"LNA00135"},{"$f":" WINEP_Inputs!J181","v":"7AW202031"},{"$f":" WINEP_Inputs!K181","v":"Fulbeck STW"},{"$f":"WINEP_Inputs!CW181","v":"£m"},{"$f":"WINEP_Inputs!CX181","v":1},null,{"$f":" WINEP_Inputs!CR181","v":3.4929999999999999},{"$f":" WINEP_Inputs!CS181","v":1},{"$f":" WINEP_Inputs!CT181","v":1},{"$f":" WINEP_Inputs!CU181","v":1},{"$f":" WINEP_Inputs!CV181","v":"WWN"},1]
[null,null,{"$f":" WINEP_Inputs!A182","v":"LNA00137"},{"$f":" WINEP_Inputs!J182","v":"7AW202033"},{"$f":" WINEP_Inputs!K182","v":"Glentworth STW"},{"$f":"WINEP_Inputs!CW182","v":"£m"},{"$f":"WINEP_Inputs!CX182","v":1},null,{"$f":" WINEP_Inputs!CR182","v":0.157},{"$f":" WINEP_Inputs!CS182","v":1},{"$f":" WINEP_Inputs!CT182","v":1},{"$f":" WINEP_Inputs!CU182","v":1},{"$f":" WINEP_Inputs!CV182","v":"WWN"},1]
[null,null,{"$f":" WINEP_Inputs!A183","v":"LNA00138"},{"$f":" WINEP_Inputs!J183","v":"7AW202034"},{"$f":" WINEP_Inputs!K183","v":"Great Ponton STW"},{"$f":"WINEP_Inputs!CW183","v":"£m"},{"$f":"WINEP_Inputs!CX183","v":1},null,{"$f":" WINEP_Inputs!CR183","v":0.159},{"$f":" WINEP_Inputs!CS183","v":1},{"$f":" WINEP_Inputs!CT183","v":1},{"$f":" WINEP_Inputs!CU183","v":1},{"$f":" WINEP_Inputs!CV183","v":"WWN"},1]
[null,null,{"$f":" WINEP_Inputs!A184","v":"LNA00140"},{"$f":" WINEP_Inputs!J184","v":"7AW202036"},{"$f":" WINEP_Inputs!K184","v":"Harlaxton STW"},{"$f":"WINEP_Inputs!CW184","v":"£m"},{"$f":"WINEP_Inputs!CX184","v":1},null,{"$f":" WINEP_Inputs!CR184","v":1.976},{"$f":" WINEP_Inputs!CS184","v":1},{"$f":" WINEP_Inputs!CT184","v":1},{"$f":" WINEP_Inputs!CU184","v":1},{"$f":" WINEP_Inputs!CV184","v":"WWN"},1]
[null,null,{"$f":" WINEP_Inputs!A185","v":"LNA00143"},{"$f":" WINEP_Inputs!J185","v":"7AW202039"},{"$f":" WINEP_Inputs!K185","v":"Horbling STW"},{"$f":"WINEP_Inputs!CW185","v":"£m"},{"$f":"WINEP_Inputs!CX185","v":1},null,{"$f":" WINEP_Inputs!CR185","v":3.75},{"$f":" WINEP_Inputs!CS185","v":1},{"$f":" WINEP_Inputs!CT185","v":1},{"$f":" WINEP_Inputs!CU185","v":1},{"$f":" WINEP_Inputs!CV185","v":"WWN"},1]
[null,null,{"$f":" WINEP_Inputs!A186","v":"LNA00144"},{"$f":" WINEP_Inputs!J186","v":"7AW202040"},{"$f":" WINEP_Inputs!K186","v":"Horncastle STW"},{"$f":"WINEP_Inputs!CW186","v":"£m"},{"$f":"WINEP_Inputs!CX186","v":1},null,{"$f":" WINEP_Inputs!CR186","v":4.0199999999999996},{"$f":" WINEP_Inputs!CS186","v":1},{"$f":" WINEP_Inputs!CT186","v":1},{"$f":" WINEP_Inputs!CU186","v":1},{"$f":" WINEP_Inputs!CV186","v":"WWN"},1]
[null,null,{"$f":" WINEP_Inputs!A187","v":"LNA00149"},{"$f":" WINEP_Inputs!J187","v":"7AW202045"},{"$f":" WINEP_Inputs!K187","v":"Legbourne STW"},{"$f":"WINEP_Inputs!CW187","v":"£m"},{"$f":"WINEP_Inputs!CX187","v":1},null,{"$f":" WINEP_Inputs!CR187","v":1.6910000000000001},{"$f":" WINEP_Inputs!CS187","v":1},{"$f":" WINEP_Inputs!CT187","v":1},{"$f":" WINEP_Inputs!CU187","v":1},{"$f":" WINEP_Inputs!CV187","v":"WWN"},1]
[null,null,{"$f":" WINEP_Inputs!A188","v":"LNA00152"},{"$f":" WINEP_Inputs!J188","v":"7AW202048"},{"$f":" WINEP_Inputs!K188","v":"Mablethorpe STW"},{"$f":"WINEP_Inputs!CW188","v":0},{"$f":"WINEP_Inputs!CX188","v":0},null,{"$f":" WINEP_Inputs!CR188","v":0},{"$f":" WINEP_Inputs!CS188","v":0},{"$f":" WINEP_Inputs!CT188","v":0},{"$f":" WINEP_Inputs!CU188","v":0},{"$f":" WINEP_Inputs!CV188","v":0},0]
[null,null,{"$f":" WINEP_Inputs!A189","v":"LNA00153"},{"$f":" WINEP_Inputs!J189","v":"7AW202049"},{"$f":" WINEP_Inputs!K189","v":"Manby STW"},{"$f":"WINEP_Inputs!CW189","v":"£m"},{"$f":"WINEP_Inputs!CX189","v":1},null,{"$f":" WINEP_Inputs!CR189","v":2.9990000000000001},{"$f":" WINEP_Inputs!CS189","v":1},{"$f":" WINEP_Inputs!CT189","v":1},{"$f":" WINEP_Inputs!CU189","v":1},{"$f":" WINEP_Inputs!CV189","v":"WWN"},1]
[null,null,{"$f":" WINEP_Inputs!A190","v":"LNA00159"},{"$f":" WINEP_Inputs!J190","v":"7AW202055"},{"$f":" WINEP_Inputs!K190","v":"Navenby STW"},{"$f":"WINEP_Inputs!CW190","v":"£m"},{"$f":"WINEP_Inputs!CX190","v":1},null,{"$f":" WINEP_Inputs!CR190","v":0.09},{"$f":" WINEP_Inputs!CS190","v":1},{"$f":" WINEP_Inputs!CT190","v":1},{"$f":" WINEP_Inputs!CU190","v":1},{"$f":" WINEP_Inputs!CV190","v":"WWN"},1]
[null,null,{"$f":" WINEP_Inputs!A191","v":"LNA00160"},{"$f":" WINEP_Inputs!J191","v":"7AW202056"},{"$f":" WINEP_Inputs!K191","v":"Nettleham STW"},{"$f":"WINEP_Inputs!CW191","v":"£m"},{"$f":"WINEP_Inputs!CX191","v":1},null,{"$f":" WINEP_Inputs!CR191","v":3.048},{"$f":" WINEP_Inputs!CS191","v":1},{"$f":" WINEP_Inputs!CT191","v":1},{"$f":" WINEP_Inputs!CU191","v":1},{"$f":" WINEP_Inputs!CV191","v":"WWN"},1]
[null,null,{"$f":" WINEP_Inputs!A192","v":"LNA00165"},{"$f":" WINEP_Inputs!J192","v":"7AW202061"},{"$f":" WINEP_Inputs!K192","v":"Osbournby STW"},{"$f":"WINEP_Inputs!CW192","v":"£m"},{"$f":"WINEP_Inputs!CX192","v":1},null,{"$f":" WINEP_Inputs!CR192","v":1.85},{"$f":" WINEP_Inputs!CS192","v":1},{"$f":" WINEP_Inputs!CT192","v":1},{"$f":" WINEP_Inputs!CU192","v":1},{"$f":" WINEP_Inputs!CV192","v":"WWN"},1]
[null,null,{"$f":" WINEP_Inputs!A193","v":"LNA00167"},{"$f":" WINEP_Inputs!J193","v":"7AW202063"},{"$f":" WINEP_Inputs!K193","v":"Reepham (Lincs) STW"},{"$f":"WINEP_Inputs!CW193","v":"£m"},{"$f":"WINEP_Inputs!CX193","v":1},null,{"$f":" WINEP_Inputs!CR193","v":4.2850000000000001},{"$f":" WINEP_Inputs!CS193","v":1},{"$f":" WINEP_Inputs!CT193","v":1},{"$f":" WINEP_Inputs!CU193","v":1},{"$f":" WINEP_Inputs!CV193","v":"WWN"},1]
[null,null,{"$f":" WINEP_Inputs!A194","v":"LNA00172"},{"$f":" WINEP_Inputs!J194","v":"7AW202068"},{"$f":" WINEP_Inputs!K194","v":"Silk Willoughby STW"},{"$f":"WINEP_Inputs!CW194","v":"£m"},{"$f":"WINEP_Inputs!CX194","v":1},null,{"$f":" WINEP_Inputs!CR194","v":1.5780000000000001},{"$f":" WINEP_Inputs!CS194","v":1},{"$f":" WINEP_Inputs!CT194","v":1},{"$f":" WINEP_Inputs!CU194","v":1},{"$f":" WINEP_Inputs!CV194","v":"WWN"},1]
[null,null,{"$f":" WINEP_Inputs!A195","v":"LNA00178"},{"$f":" WINEP_Inputs!J195","v":"7AW202074"},{"$f":" WINEP_Inputs!K195","v":"South Witham STW"},{"$f":"WINEP_Inputs!CW195","v":"£m"},{"$f":"WINEP_Inputs!CX195","v":1},null,{"$f":" WINEP_Inputs!CR195","v":3.3940000000000001},{"$f":" WINEP_Inputs!CS195","v":1},{"$f":" WINEP_Inputs!CT195","v":1},{"$f":" WINEP_Inputs!CU195","v":1},{"$f":" WINEP_Inputs!CV195","v":"WWN"},1]
[null,null,{"$f":" WINEP_Inputs!A196","v":"LNA00182"},{"$f":" WINEP_Inputs!J196","v":"7AW202078"},{"$f":" WINEP_Inputs!K196","v":"Strubby STW"},{"$f":"WINEP_Inputs!CW196","v":"£m"},{"$f":"WINEP_Inputs!CX196","v":1},null,{"$f":" WINEP_Inputs!CR196","v":2.4380000000000002},{"$f":" WINEP_Inputs!CS196","v":1},{"$f":" WINEP_Inputs!CT196","v":1},{"$f":" WINEP_Inputs!CU196","v":1},{"$f":" WINEP_Inputs!CV196","v":"WWN"},1]
[null,null,{"$f":" WINEP_Inputs!A197","v":"LNA00189"},{"$f":" WINEP_Inputs!J197","v":"7AW202085"},{"$f":" WINEP_Inputs!K197","v":"Toynton St Peter STW"},{"$f":"WINEP_Inputs!CW197","v":"£m"},{"$f":"WINEP_Inputs!CX197","v":1},null,{"$f":" WINEP_Inputs!CR197","v":1.5780000000000001},{"$f":" WINEP_Inputs!CS197","v":1},{"$f":" WINEP_Inputs!CT197","v":1},{"$f":" WINEP_Inputs!CU197","v":1},{"$f":" WINEP_Inputs!CV197","v":"WWN"},1]
[null,null,{"$f":" WINEP_Inputs!A198","v":"LNA00190"},{"$f":" WINEP_Inputs!J198","v":"7AW202086"},{"$f":" WINEP_Inputs!K198","v":"Upton STW"},{"$f":"WINEP_Inputs!CW198","v":"£m"},{"$f":"WINEP_Inputs!CX198","v":1},null,{"$f":" WINEP_Inputs!CR198","v":0.22500000000000001},{"$f":" WINEP_Inputs!CS198","v":1},{"$f":" WINEP_Inputs!CT198","v":1},{"$f":" WINEP_Inputs!CU198","v":1},{"$f":" WINEP_Inputs!CV198","v":"WWN"},1]
[null,null,{"$f":" WINEP_Inputs!A199","v":"LNA00193"},{"$f":" WINEP_Inputs!J199","v":"7AW202089"},{"$f":" WINEP_Inputs!K199","v":"Willingham (Lincs) STW"},{"$f":"WINEP_Inputs!CW199","v":"£m"},{"$f":"WINEP_Inputs!CX199","v":1},null,{"$f":" WINEP_Inputs!CR199","v":0.52100000000000002},{"$f":" WINEP_Inputs!CS199","v":1},{"$f":" WINEP_Inputs!CT199","v":1},{"$f":" WINEP_Inputs!CU199","v":1},{"$f":" WINEP_Inputs!CV199","v":"WWN"},1]
[null,null,{"$f":" WINEP_Inputs!A200","v":"LNA00195"},{"$f":" WINEP_Inputs!J200","v":"7AW202091"},{"$f":" WINEP_Inputs!K200","v":"Wragby STW"},{"$f":"WINEP_Inputs!CW200","v":"£m"},{"$f":"WINEP_Inputs!CX200","v":1},null,{"$f":" WINEP_Inputs!CR200","v":3.3380000000000001},{"$f":" WINEP_Inputs!CS200","v":1},{"$f":" WINEP_Inputs!CT200","v":1},{"$f":" WINEP_Inputs!CU200","v":1},{"$f":" WINEP_Inputs!CV200","v":"WWN"},1]
[null,null,{"$f":" WINEP_Inputs!A201","v":"LNA00207"},{"$f":" WINEP_Inputs!J201","v":"7AW202103"},{"$f":" WINEP_Inputs!K201","v":"Gosberton STW"},{"$f":"WINEP_Inputs!CW201","v":"£m"},{"$f":"WINEP_Inputs!CX201","v":1},null,{"$f":" WINEP_Inputs!CR201","v":2.2909999999999999},{"$f":" WINEP_Inputs!CS201","v":1},{"$f":" WINEP_Inputs!CT201","v":1},{"$f":" WINEP_Inputs!CU201","v":1},{"$f":" WINEP_Inputs!CV201","v":"WWN"},1]
[null,null,{"$f":" WINEP_Inputs!A202","v":"LNA00211"},{"$f":" WINEP_Inputs!J202","v":"7AW202107"},{"$f":" WINEP_Inputs!K202","v":"Holbeach STW"},{"$f":"WINEP_Inputs!CW202","v":0},{"$f":"WINEP_Inputs!CX202","v":0},null,{"$f":" WINEP_Inputs!CR202","v":0},{"$f":" WINEP_Inputs!CS202","v":0},{"$f":" WINEP_Inputs!CT202","v":0},{"$f":" WINEP_Inputs!CU202","v":0},{"$f":" WINEP_Inputs!CV202","v":0},0]
[null,null,{"$f":" WINEP_Inputs!A203","v":"LNA00215"},{"$f":" WINEP_Inputs!J203","v":"7AW202111"},{"$f":" WINEP_Inputs!K203","v":"Kibworth STW"},{"$f":"WINEP_Inputs!CW203","v":0},{"$f":"WINEP_Inputs!CX203","v":0},null,{"$f":" WINEP_Inputs!CR203","v":0},{"$f":" WINEP_Inputs!CS203","v":0},{"$f":" WINEP_Inputs!CT203","v":0},{"$f":" WINEP_Inputs!CU203","v":0},{"$f":" WINEP_Inputs!CV203","v":0},{"$f":" IF(K208 = 0, 0, K208 / J208)","v":0}]
[null,null,{"$f":" WINEP_Inputs!A204","v":"LNA00217"},{"$f":" WINEP_Inputs!J204","v":"7AW202113"},{"$f":" WINEP_Inputs!K204","v":"Little Bytham STW"},{"$f":"WINEP_Inputs!CW204","v":"£m"},{"$f":"WINEP_Inputs!CX204","v":1},null,{"$f":" WINEP_Inputs!CR204","v":2.8809999999999998},{"$f":" WINEP_Inputs!CS204","v":1},{"$f":" WINEP_Inputs!CT204","v":1},{"$f":" WINEP_Inputs!CU204","v":1},{"$f":" WINEP_Inputs!CV204","v":"WWN"},1]
[null,null,{"$f":" WINEP_Inputs!A205","v":"LNA00219"},{"$f":" WINEP_Inputs!J205","v":"7AW202115"},{"$f":" WINEP_Inputs!K205","v":"Market Harborough STW"},{"$f":"WINEP_Inputs!CW205","v":0},{"$f":"WINEP_Inputs!CX205","v":0},null,{"$f":" WINEP_Inputs!CR205","v":0},{"$f":" WINEP_Inputs!CS205","v":0},{"$f":" WINEP_Inputs!CT205","v":0},{"$f":" WINEP_Inputs!CU205","v":0},{"$f":" WINEP_Inputs!CV205","v":0},0]
[null,null,{"$f":" WINEP_Inputs!A206","v":"LNA00229"},{"$f":" WINEP_Inputs!J206","v":"7AW202125"},{"$f":" WINEP_Inputs!K206","v":"Sibbertoft STW"},{"$f":"WINEP_Inputs!CW206","v":"£m"},{"$f":"WINEP_Inputs!CX206","v":1},null,{"$f":" WINEP_Inputs!CR206","v":2.9140000000000001},{"$f":" WINEP_Inputs!CS206","v":1},{"$f":" WINEP_Inputs!CT206","v":1},{"$f":" WINEP_Inputs!CU206","v":1},{"$f":" WINEP_Inputs!CV206","v":"WWN"},1]
[null,null,{"$f":" WINEP_Inputs!A207","v":"LNA00239"},{"$f":" WINEP_Inputs!J207","v":"7AW202135"},{"$f":" WINEP_Inputs!K207","v":"Wing STW"},{"$f":"WINEP_Inputs!CW207","v":"£m"},{"$f":"WINEP_Inputs!CX207","v":1},null,{"$f":" WINEP_Inputs!CR207","v":1.248},{"$f":" WINEP_Inputs!CS207","v":1},{"$f":" WINEP_Inputs!CT207","v":1},{"$f":" WINEP_Inputs!CU207","v":1},{"$f":" WINEP_Inputs!CV207","v":"WWN"},1]
[null,null,{"$f":" WINEP_Inputs!A208","v":"LNA00243"},{"$f":" WINEP_Inputs!J208","v":"7AW202139"},{"$f":" WINEP_Inputs!K208","v":"Caistor STW"},{"$f":"WINEP_Inputs!CW208","v":"£m"},{"$f":"WINEP_Inputs!CX208","v":1},null,{"$f":" WINEP_Inputs!CR208","v":3.1429999999999998},{"$f":" WINEP_Inputs!CS208","v":1},{"$f":" WINEP_Inputs!CT208","v":1},{"$f":" WINEP_Inputs!CU208","v":1},{"$f":" WINEP_Inputs!CV208","v":"WWN"},1]
[null,null,{"$f":" WINEP_Inputs!A209","v":"LNA00244"},{"$f":" WINEP_Inputs!J209","v":"7AW202140"},{"$f":" WINEP_Inputs!K209","v":"Faldingworth (Ex MOD) STW"},{"$f":"WINEP_Inputs!CW209","v":"£m"},{"$f":"WINEP_Inputs!CX209","v":1},null,{"$f":" WINEP_Inputs!CR209","v":1.583},{"$f":" WINEP_Inputs!CS209","v":1},{"$f":" WINEP_Inputs!CT209","v":1},{"$f":" WINEP_Inputs!CU209","v":1},{"$f":" WINEP_Inputs!CV209","v":"WWN"},1]
[null,null,{"$f":" WINEP_Inputs!A210","v":"LNA00245"},{"$f":" WINEP_Inputs!J210","v":"7AW202141"},{"$f":" WINEP_Inputs!K210","v":"Glentham STW"},{"$f":"WINEP_Inputs!CW210","v":"£m"},{"$f":"WINEP_Inputs!CX210","v":1},null,{"$f":" WINEP_Inputs!CR210","v":0.65100000000000002},{"$f":" WINEP_Inputs!CS210","v":1},{"$f":" WINEP_Inputs!CT210","v":1},{"$f":" WINEP_Inputs!CU210","v":1},{"$f":" WINEP_Inputs!CV210","v":"WWN"},1]
[null,null,{"$f":" WINEP_Inputs!A211","v":"LNA00249"},{"$f":" WINEP_Inputs!J211","v":"7AW202145"},{"$f":" WINEP_Inputs!K211","v":"Laceby STW"},{"$f":"WINEP_Inputs!CW211","v":"£m"},{"$f":"WINEP_Inputs!CX211","v":1},null,{"$f":" WINEP_Inputs!CR211","v":3.1230000000000002},{"$f":" WINEP_Inputs!CS211","v":1},{"$f":" WINEP_Inputs!CT211","v":1},{"$f":" WINEP_Inputs!CU211","v":1},{"$f":" WINEP_Inputs!CV211","v":"WWN"},1]
[null,null,{"$f":" WINEP_Inputs!A212","v":"LNA00250"},{"$f":" WINEP_Inputs!J212","v":"7AW202146"},{"$f":" WINEP_Inputs!K212","v":"Louth STW"},{"$f":"WINEP_Inputs!CW212","v":"£m"},{"$f":"WINEP_Inputs!CX212","v":1},null,{"$f":" WINEP_Inputs!CR212","v":6.34},{"$f":" WINEP_Inputs!CS212","v":1},{"$f":" WINEP_Inputs!CT212","v":1},{"$f":" WINEP_Inputs!CU212","v":1},{"$f":" WINEP_Inputs!CV212","v":"WWN"},1]
[null,null,{"$f":" WINEP_Inputs!A213","v":"LNA00251"},{"$f":" WINEP_Inputs!J213","v":"7AW202147"},{"$f":" WINEP_Inputs!K213","v":"Market Rasen STW"},{"$f":"WINEP_Inputs!CW213","v":"£m"},{"$f":"WINEP_Inputs!CX213","v":1},null,{"$f":" WINEP_Inputs!CR213","v":2.2330000000000001},{"$f":" WINEP_Inputs!CS213","v":1},{"$f":" WINEP_Inputs!CT213","v":1},{"$f":" WINEP_Inputs!CU213","v":1},{"$f":" WINEP_Inputs!CV213","v":"WWN"},1]
[null,null,{"$f":" WINEP_Inputs!A214","v":"LNA00254"},{"$f":" WINEP_Inputs!J214","v":"7AW202150"},{"$f":" WINEP_Inputs!K214","v":"Owmby STW"},{"$f":"WINEP_Inputs!CW214","v":"£m"},{"$f":"WINEP_Inputs!CX214","v":1},null,{"$f":" WINEP_Inputs!CR214","v":0.22500000000000001},{"$f":" WINEP_Inputs!CS214","v":1},{"$f":" WINEP_Inputs!CT214","v":1},{"$f":" WINEP_Inputs!CU214","v":1},{"$f":" WINEP_Inputs!CV214","v":"WWN"},1]
[null,null,{"$f":" WINEP_Inputs!A215","v":"LNA00255"},{"$f":" WINEP_Inputs!J215","v":"7AW202151"},{"$f":" WINEP_Inputs!K215","v":"Tealby STW"},{"$f":"WINEP_Inputs!CW215","v":"£m"},{"$f":"WINEP_Inputs!CX215","v":1},null,{"$f":" WINEP_Inputs!CR215","v":1.347},{"$f":" WINEP_Inputs!CS215","v":1},{"$f":" WINEP_Inputs!CT215","v":1},{"$f":" WINEP_Inputs!CU215","v":1},{"$f":" WINEP_Inputs!CV215","v":"WWN"},1]
[null,null,{"$f":" WINEP_Inputs!A216","v":"LNA00256"},{"$f":" WINEP_Inputs!J216","v":"7AW202152"},{"$f":" WINEP_Inputs!K216","v":"Ulceby STW"},{"$f":"WINEP_Inputs!CW216","v":"£m"},{"$f":"WINEP_Inputs!CX216","v":1},null,{"$f":" WINEP_Inputs!CR216","v":2.9460000000000002},{"$f":" WINEP_Inputs!CS216","v":1},{"$f":" WINEP_Inputs!CT216","v":1},{"$f":" WINEP_Inputs!CU216","v":1},{"$f":" WINEP_Inputs!CV216","v":"WWN"},1]
[null,null,{"$f":" WINEP_Inputs!A217","v":"LNA00263"},{"$f":" WINEP_Inputs!J217","v":"7AW202159"},{"$f":" WINEP_Inputs!K217","v":"Corby Glen STW"},{"$f":"WINEP_Inputs!CW217","v":"£m"},{"$f":"WINEP_Inputs!CX217","v":1},null,{"$f":" WINEP_Inputs!CR217","v":1.8440000000000001},{"$f":" WINEP_Inputs!CS217","v":1},{"$f":" WINEP_Inputs!CT217","v":1},{"$f":" WINEP_Inputs!CU217","v":1},{"$f":" WINEP_Inputs!CV217","v":"WWN"},1]
[null,null,{"$f":" WINEP_Inputs!A218","v":"LNA00273"},{"$f":" WINEP_Inputs!J218","v":"7AW202169"},{"$f":" WINEP_Inputs!K218","v":"DrWPA - Aswarby"},{"$f":"WINEP_Inputs!CW218","v":"£m"},{"$f":"WINEP_Inputs!CX218","v":1},null,{"$f":" WINEP_Inputs!CR218","v":3.1E-2},{"$f":" WINEP_Inputs!CS218","v":1},{"$f":" WINEP_Inputs!CT218","v":1},{"$f":" WINEP_Inputs!CU218","v":1},{"$f":" WINEP_Inputs!CV218","v":"WWN"},1]
[null,null,{"$f":" WINEP_Inputs!A219","v":"LNA00274"},{"$f":" WINEP_Inputs!J219","v":"7AW202170"},{"$f":" WINEP_Inputs!K219","v":"DrWPA - Barnoldby"},{"$f":"WINEP_Inputs!CW219","v":"£m"},{"$f":"WINEP_Inputs!CX219","v":1},null,{"$f":" WINEP_Inputs!CR219","v":3.1E-2},{"$f":" WINEP_Inputs!CS219","v":1},{"$f":" WINEP_Inputs!CT219","v":1},{"$f":" WINEP_Inputs!CU219","v":1},{"$f":" WINEP_Inputs!CV219","v":"WWN"},1]
[null,null,{"$f":" WINEP_Inputs!A220","v":"LNA00275"},{"$f":" WINEP_Inputs!J220","v":"7AW202171"},{"$f":" WINEP_Inputs!K220","v":"DrWPA - Barrow"},{"$f":"WINEP_Inputs!CW220","v":"£m"},{"$f":"WINEP_Inputs!CX220","v":1},null,{"$f":" WINEP_Inputs!CR220","v":3.1E-2},{"$f":" WINEP_Inputs!CS220","v":1},{"$f":" WINEP_Inputs!CT220","v":1},{"$f":" WINEP_Inputs!CU220","v":1},{"$f":" WINEP_Inputs!CV220","v":"WWN"},1]
[null,null,{"$f":" WINEP_Inputs!A221","v":"LNA00276"},{"$f":" WINEP_Inputs!J221","v":"7AW202172"},{"$f":" WINEP_Inputs!K221","v":"DrWPA - Barton"},{"$f":"WINEP_Inputs!CW221","v":"£m"},{"$f":"WINEP_Inputs!CX221","v":1},null,{"$f":" WINEP_Inputs!CR221","v":3.1E-2},{"$f":" WINEP_Inputs!CS221","v":1},{"$f":" WINEP_Inputs!CT221","v":1},{"$f":" WINEP_Inputs!CU221","v":1},{"$f":" WINEP_Inputs!CV221","v":"WWN"},1]
[null,null,{"$f":" WINEP_Inputs!A222","v":"LNA00277"},{"$f":" WINEP_Inputs!J222","v":"7AW202173"},{"$f":" WINEP_Inputs!K222","v":"DrWPA - Drove Lane"},{"$f":"WINEP_Inputs!CW222","v":"£m"},{"$f":"WINEP_Inputs!CX222","v":1},null,{"$f":" WINEP_Inputs!CR222","v":3.1E-2},{"$f":" WINEP_Inputs!CS222","v":1},{"$f":" WINEP_Inputs!CT222","v":1},{"$f":" WINEP_Inputs!CU222","v":1},{"$f":" WINEP_Inputs!CV222","v":"WWN"},1]
[null,null,{"$f":" WINEP_Inputs!A223","v":"LNA00278"},{"$f":" WINEP_Inputs!J223","v":"7AW202174"},{"$f":" WINEP_Inputs!K223","v":"DrWPA - Dunston"},{"$f":"WINEP_Inputs!CW223","v":"£m"},{"$f":"WINEP_Inputs!CX223","v":1},null,{"$f":" WINEP_Inputs!CR223","v":3.1E-2},{"$f":" WINEP_Inputs!CS223","v":1},{"$f":" WINEP_Inputs!CT223","v":1},{"$f":" WINEP_Inputs!CU223","v":1},{"$f":" WINEP_Inputs!CV223","v":"WWN"},1]
[null,null,{"$f":" WINEP_Inputs!A224","v":"LNA00279"},{"$f":" WINEP_Inputs!J224","v":"7AW202175"},{"$f":" WINEP_Inputs!K224","v":"Etton"},{"$f":"WINEP_Inputs!CW224","v":"£m"},{"$f":"WINEP_Inputs!CX224","v":1},null,{"$f":" WINEP_Inputs!CR224","v":4.2480000000000002},{"$f":" WINEP_Inputs!CS224","v":1},{"$f":" WINEP_Inputs!CT224","v":1},{"$f":" WINEP_Inputs!CU224","v":1},{"$f":" WINEP_Inputs!CV224","v":"WWN"},1]
[null,null,{"$f":" WINEP_Inputs!A225","v":"LNA00280"},{"$f":" WINEP_Inputs!J225","v":"7AW202176"},{"$f":" WINEP_Inputs!K225","v":"DrWPA - Goxhill 2"},{"$f":"WINEP_Inputs!CW225","v":"£m"},{"$f":"WINEP_Inputs!CX225","v":1},null,{"$f":" WINEP_Inputs!CR225","v":3.1E-2},{"$f":" WINEP_Inputs!CS225","v":1},{"$f":" WINEP_Inputs!CT225","v":1},{"$f":" WINEP_Inputs!CU225","v":1},{"$f":" WINEP_Inputs!CV225","v":"WWN"},1]
[null,null,{"$f":" WINEP_Inputs!A226","v":"LNA00281"},{"$f":" WINEP_Inputs!J226","v":"7AW202177"},{"$f":" WINEP_Inputs!K226","v":"DrWPA - Habrough"},{"$f":"WINEP_Inputs!CW226","v":"£m"},{"$f":"WINEP_Inputs!CX226","v":1},null,{"$f":" WINEP_Inputs!CR226","v":3.1E-2},{"$f":" WINEP_Inputs!CS226","v":1},{"$f":" WINEP_Inputs!CT226","v":1},{"$f":" WINEP_Inputs!CU226","v":1},{"$f":" WINEP_Inputs!CV226","v":"WWN"},1]
[null,null,{"$f":" WINEP_Inputs!A227","v":"LNA00282"},{"$f":" WINEP_Inputs!J227","v":"7AW202178"},{"$f":" WINEP_Inputs!K227","v":"DrWPA - Healing"},{"$f":"WINEP_Inputs!CW227","v":"£m"},{"$f":"WINEP_Inputs!CX227","v":1},null,{"$f":" WINEP_Inputs!CR227","v":3.1E-2},{"$f":" WINEP_Inputs!CS227","v":1},{"$f":" WINEP_Inputs!CT227","v":1},{"$f":" WINEP_Inputs!CU227","v":1},{"$f":" WINEP_Inputs!CV227","v":"WWN"},1]
[null,null,{"$f":" WINEP_Inputs!A228","v":"LNA00283"},{"$f":" WINEP_Inputs!J228","v":"7AW202179"},{"$f":" WINEP_Inputs!K228","v":"DrWPA - Little London"},{"$f":"WINEP_Inputs!CW228","v":"£m"},{"$f":"WINEP_Inputs!CX228","v":1},null,{"$f":" WINEP_Inputs!CR228","v":3.1E-2},{"$f":" WINEP_Inputs!CS228","v":1},{"$f":" WINEP_Inputs!CT228","v":1},{"$f":" WINEP_Inputs!CU228","v":1},{"$f":" WINEP_Inputs!CV228","v":"WWN"},1]
[null,null,{"$f":" WINEP_Inputs!A229","v":"LNA00284"},{"$f":" WINEP_Inputs!J229","v":"7AW202180"},{"$f":" WINEP_Inputs!K229","v":"DrWPA - Littlecoates"},{"$f":"WINEP_Inputs!CW229","v":"£m"},{"$f":"WINEP_Inputs!CX229","v":1},null,{"$f":" WINEP_Inputs!CR229","v":3.1E-2},{"$f":" WINEP_Inputs!CS229","v":1},{"$f":" WINEP_Inputs!CT229","v":1},{"$f":" WINEP_Inputs!CU229","v":1},{"$f":" WINEP_Inputs!CV229","v":"WWN"},1]
[null,null,{"$f":" WINEP_Inputs!A230","v":"LNA00285"},{"$f":" WINEP_Inputs!J230","v":"7AW202181"},{"$f":" WINEP_Inputs!K230","v":"DrWPA - Thornton Curtis"},{"$f":"WINEP_Inputs!CW230","v":"£m"},{"$f":"WINEP_Inputs!CX230","v":1},null,{"$f":" WINEP_Inputs!CR230","v":3.1E-2},{"$f":" WINEP_Inputs!CS230","v":1},{"$f":" WINEP_Inputs!CT230","v":1},{"$f":" WINEP_Inputs!CU230","v":1},{"$f":" WINEP_Inputs!CV230","v":"WWN"},1]
[null,null,{"$f":" WINEP_Inputs!A231","v":"LNA00286"},{"$f":" WINEP_Inputs!J231","v":"7AW202182"},{"$f":" WINEP_Inputs!K231","v":"DrWPA - Ulceby"},{"$f":"WINEP_Inputs!CW231","v":"£m"},{"$f":"WINEP_Inputs!CX231","v":1},null,{"$f":" WINEP_Inputs!CR231","v":3.1E-2},{"$f":" WINEP_Inputs!CS231","v":1},{"$f":" WINEP_Inputs!CT231","v":1},{"$f":" WINEP_Inputs!CU231","v":1},{"$f":" WINEP_Inputs!CV231","v":"WWN"},1]
[null,null,{"$f":" WINEP_Inputs!A232","v":"EAN00422"},{"$f":" WINEP_Inputs!J232","v":"7AW202261"},{"$f":" WINEP_Inputs!K232","v":"DrWPA - Trowse Newton"},{"$f":"WINEP_Inputs!CW232","v":"£m"},{"$f":"WINEP_Inputs!CX232","v":1},null,{"$f":" WINEP_Inputs!CR232","v":3.1E-2},{"$f":" WINEP_Inputs!CS232","v":1},{"$f":" WINEP_Inputs!CT232","v":1},{"$f":" WINEP_Inputs!CU232","v":1},{"$f":" WINEP_Inputs!CV232","v":"WWN"},1]
[null,null,{"$f":" WINEP_Inputs!A233","v":"EAN00424"},{"$f":" WINEP_Inputs!J233","v":"7AW202263"},{"$f":" WINEP_Inputs!K233","v":"DrWPA - Glandford"},{"$f":"WINEP_Inputs!CW233","v":"£m"},{"$f":"WINEP_Inputs!CX233","v":1},null,{"$f":" WINEP_Inputs!CR233","v":3.1E-2},{"$f":" WINEP_Inputs!CS233","v":1},{"$f":" WINEP_Inputs!CT233","v":1},{"$f":" WINEP_Inputs!CU233","v":1},{"$f":" WINEP_Inputs!CV233","v":"WWN"},1]
[null,null,{"$f":" WINEP_Inputs!A234","v":"EAN00428"},{"$f":" WINEP_Inputs!J234","v":"7AW202265"},{"$f":" WINEP_Inputs!K234","v":"DrWPA - Beachamwell"},{"$f":"WINEP_Inputs!CW234","v":"£m"},{"$f":"WINEP_Inputs!CX234","v":1},null,{"$f":" WINEP_Inputs!CR234","v":3.1E-2},{"$f":" WINEP_Inputs!CS234","v":1},{"$f":" WINEP_Inputs!CT234","v":1},{"$f":" WINEP_Inputs!CU234","v":1},{"$f":" WINEP_Inputs!CV234","v":"WWN"},1]
[null,null,{"$f":" WINEP_Inputs!A235","v":"EAN00430"},{"$f":" WINEP_Inputs!J235","v":"7AW202266"},{"$f":" WINEP_Inputs!K235","v":"DrWPA - Isleham"},{"$f":"WINEP_Inputs!CW235","v":"£m"},{"$f":"WINEP_Inputs!CX235","v":1},null,{"$f":" WINEP_Inputs!CR235","v":3.1E-2},{"$f":" WINEP_Inputs!CS235","v":1},{"$f":" WINEP_Inputs!CT235","v":1},{"$f":" WINEP_Inputs!CU235","v":1},{"$f":" WINEP_Inputs!CV235","v":"WWN"},1]
[null,null,{"$f":" WINEP_Inputs!A236","v":"EAN00431"},{"$f":" WINEP_Inputs!J236","v":"7AW202267"},{"$f":" WINEP_Inputs!K236","v":"DrWPA - Lower Links"},{"$f":"WINEP_Inputs!CW236","v":"£m"},{"$f":"WINEP_Inputs!CX236","v":1},null,{"$f":" WINEP_Inputs!CR236","v":3.1E-2},{"$f":" WINEP_Inputs!CS236","v":1},{"$f":" WINEP_Inputs!CT236","v":1},{"$f":" WINEP_Inputs!CU236","v":1},{"$f":" WINEP_Inputs!CV236","v":"WWN"},1]
[null,null,{"$f":" WINEP_Inputs!A237","v":"EAN00432"},{"$f":" WINEP_Inputs!J237","v":"7AW202268"},{"$f":" WINEP_Inputs!K237","v":"DrWPA - Moulton"},{"$f":"WINEP_Inputs!CW237","v":"£m"},{"$f":"WINEP_Inputs!CX237","v":1},null,{"$f":" WINEP_Inputs!CR237","v":3.1E-2},{"$f":" WINEP_Inputs!CS237","v":1},{"$f":" WINEP_Inputs!CT237","v":1},{"$f":" WINEP_Inputs!CU237","v":1},{"$f":" WINEP_Inputs!CV237","v":"WWN"},1]
[null,null,{"$f":" WINEP_Inputs!A238","v":"EAN00434"},{"$f":" WINEP_Inputs!J238","v":"7AW202269"},{"$f":" WINEP_Inputs!K238","v":"DrWPA - Nunnery Lodge"},{"$f":"WINEP_Inputs!CW238","v":"£m"},{"$f":"WINEP_Inputs!CX238","v":1},null,{"$f":" WINEP_Inputs!CR238","v":3.1E-2},{"$f":" WINEP_Inputs!CS238","v":1},{"$f":" WINEP_Inputs!CT238","v":1},{"$f":" WINEP_Inputs!CU238","v":1},{"$f":" WINEP_Inputs!CV238","v":"WWN"},1]
[null,null,{"$f":" WINEP_Inputs!A239","v":"EAN00437"},{"$f":" WINEP_Inputs!J239","v":"7AW202270"},{"$f":" WINEP_Inputs!K239","v":"DrWPA - Square Plantation"},{"$f":"WINEP_Inputs!CW239","v":"£m"},{"$f":"WINEP_Inputs!CX239","v":1},null,{"$f":" WINEP_Inputs!CR239","v":3.1E-2},{"$f":" WINEP_Inputs!CS239","v":1},{"$f":" WINEP_Inputs!CT239","v":1},{"$f":" WINEP_Inputs!CU239","v":1},{"$f":" WINEP_Inputs!CV239","v":"WWN"},1]
[null,null,{"$f":" WINEP_Inputs!A240","v":"EAN00442"},{"$f":" WINEP_Inputs!J240","v":"7AW202271"},{"$f":" WINEP_Inputs!K240","v":"DrWPA - Fring"},{"$f":"WINEP_Inputs!CW240","v":"£m"},{"$f":"WINEP_Inputs!CX240","v":1},null,{"$f":" WINEP_Inputs!CR240","v":3.1E-2},{"$f":" WINEP_Inputs!CS240","v":1},{"$f":" WINEP_Inputs!CT240","v":1},{"$f":" WINEP_Inputs!CU240","v":1},{"$f":" WINEP_Inputs!CV240","v":"WWN"},1]
[null,null,{"$f":" WINEP_Inputs!A241","v":"EAN00443"},{"$f":" WINEP_Inputs!J241","v":"7AW202272"},{"$f":" WINEP_Inputs!K241","v":"DrWPA - Fring Osier Carr"},{"$f":"WINEP_Inputs!CW241","v":"£m"},{"$f":"WINEP_Inputs!CX241","v":1},null,{"$f":" WINEP_Inputs!CR241","v":3.1E-2},{"$f":" WINEP_Inputs!CS241","v":1},{"$f":" WINEP_Inputs!CT241","v":1},{"$f":" WINEP_Inputs!CU241","v":1},{"$f":" WINEP_Inputs!CV241","v":"WWN"},1]
[null,null,{"$f":" WINEP_Inputs!A242","v":"EAN00445"},{"$f":" WINEP_Inputs!J242","v":"7AW202273"},{"$f":" WINEP_Inputs!K242","v":"DrWPA - Great Bircham"},{"$f":"WINEP_Inputs!CW242","v":"£m"},{"$f":"WINEP_Inputs!CX242","v":1},null,{"$f":" WINEP_Inputs!CR242","v":3.1E-2},{"$f":" WINEP_Inputs!CS242","v":1},{"$f":" WINEP_Inputs!CT242","v":1},{"$f":" WINEP_Inputs!CU242","v":1},{"$f":" WINEP_Inputs!CV242","v":"WWN"},1]
[null,null,{"$f":" WINEP_Inputs!A243","v":"EAN00446"},{"$f":" WINEP_Inputs!J243","v":"7AW202274"},{"$f":" WINEP_Inputs!K243","v":"DrWPA - Hillington (Chalk)"},{"$f":"WINEP_Inputs!CW243","v":"£m"},{"$f":"WINEP_Inputs!CX243","v":1},null,{"$f":" WINEP_Inputs!CR243","v":3.1E-2},{"$f":" WINEP_Inputs!CS243","v":1},{"$f":" WINEP_Inputs!CT243","v":1},{"$f":" WINEP_Inputs!CU243","v":1},{"$f":" WINEP_Inputs!CV243","v":"WWN"},1]
[null,null,{"$f":" WINEP_Inputs!A244","v":"CHM00048"},{"$f":" WINEP_Inputs!J244","v":"7AW300048"},{"$f":" WINEP_Inputs!K244","v":"Tuddenham STW (CIP2 T2)"},{"$f":"WINEP_Inputs!CW244","v":0},{"$f":"WINEP_Inputs!CX244","v":0},null,{"$f":" WINEP_Inputs!CR244","v":0},{"$f":" WINEP_Inputs!CS244","v":0},{"$f":" WINEP_Inputs!CT244","v":0},{"$f":" WINEP_Inputs!CU244","v":0},{"$f":" WINEP_Inputs!CV244","v":0},0]
[null,null,{"$f":" WINEP_Inputs!A245","v":"EAN02408"},{"$f":" WINEP_Inputs!J245","v":"7AW300467"},{"$f":" WINEP_Inputs!K245","v":"Watton STW"},{"$f":"WINEP_Inputs!CW245","v":"£m"},{"$f":"WINEP_Inputs!CX245","v":1},null,{"$f":" WINEP_Inputs!CR245","v":0.41599999999999998},{"$f":" WINEP_Inputs!CS245","v":1},{"$f":" WINEP_Inputs!CT245","v":1},{"$f":" WINEP_Inputs!CU245","v":1},{"$f":" WINEP_Inputs!CV245","v":"WWN"},1]
[null,null,{"$f":" WINEP_Inputs!A246","v":"LNA00380"},{"$f":" WINEP_Inputs!J246","v":"7AW300487"},{"$f":" WINEP_Inputs!K246","v":"Kirmington STW"},{"$f":"WINEP_Inputs!CW246","v":0},{"$f":"WINEP_Inputs!CX246","v":0},null,{"$f":" WINEP_Inputs!CR246","v":0},{"$f":" WINEP_Inputs!CS246","v":0},{"$f":" WINEP_Inputs!CT246","v":0},{"$f":" WINEP_Inputs!CU246","v":0},{"$f":" WINEP_Inputs!CV246","v":0},0]
[null,null,{"$f":" WINEP_Inputs!A247","v":"EAN02441 "},{"$f":" WINEP_Inputs!J247","v":" 7AW100426 "},{"$f":" WINEP_Inputs!K247","v":" N NORFOLK Ch GW / East Ruston, Witton "},{"$f":"WINEP_Inputs!CW247","v":" £m "},{"$f":"WINEP_Inputs!CX247","v":1},null,{"$f":" WINEP_Inputs!CR247","v":2.2999999999999998},{"$f":" WINEP_Inputs!CS247","v":2},{"$f":" WINEP_Inputs!CT247","v":5},{"$f":" WINEP_Inputs!CU247","v":1},{"$f":" WINEP_Inputs!CV247","v":"WN"},2.5]
["End of sheet"]

{"sheet":"WINEP_Allowance","index":11,"n_rows":273,"n_cols":22,"rows_kept":273,"cut":false,"hidden":false,"merged":[]}
[{"$f":" RIGHT(CELL(\"filename\", $A$1), LEN(CELL(\"filename\", $A$1)) - SEARCH(\"]\", CELL(\"filename\", $A$1)))","v":"WINEP_Allowance"}]
[null,null,null,null,null,{"$f":"Check!F2","v":0},"Checks"]
[null,null,null,null,null,{"$f":"Check!F3","v":3},"Track chgs"]
[]
["CALCULATION OF ADJUSTED ALLOWED COST FOR CONFIRMED SCHEMES"]
[]
["List of Amber Schemes"]
[null,"Calculate the adjusted allowed cost per scheme, £m and the WINEP reconciliation per control, £m"]
[null,null,null,null,null,null,null,null,null,null,null,null,null,null,null,null,null,"WR","WN","WWN","BR","DMY"]
[null,null,{"$f":" WINEP_Schemes!C9","v":"WINEPID"},{"$f":" WINEP_Schemes!D9","v":"Unique ID"},{"$f":" WINEP_Schemes!E9","v":"Scheme category / name"},{"$f":" WINEP_Schemes!F9","v":"Unit"},{"$f":" WINEP_Schemes!G9","v":"Unit Conversion to £m"},{"$f":" WINEP_Schemes!H9","v":0},{"$f":" WINEP_Schemes!J9","v":"Quantity in PR19 FD"},{"$f":" WINEP_Schemes!I9","v":"Allowed totex unit rate"},{"$f":" WINEP_Schemes!K9","v":"Quantity Delivered"},{"$f":" WINEP_Schemes!L9","v":"1 = In FD, funded\n0 = In FD, not funded"},{"$f":" WINEP_Schemes!M9","v":"Price Control"},{"$f":" WINEP_Schemes!N9","v":"Proportion Confirmed"},"FD Allowance, £m","Adjusted Allowance (Delivered), £m","WINEP Reconciliation, £m","Water Resources £m","Water Network £m","Wastewater Network £m","Bioresources £m","Dummy £m"]
[null,null,{"$f":"WINEP_Schemes!C10","v":"EMD00013"},{"$f":"WINEP_Schemes!D10","v":"7AW100069"},{"$f":"WINEP_Schemes!E10","v":"River Poulter - Elkesley boreholes (1,2,3,4,5,6,7)"},{"$f":"WINEP_Schemes!F10","v":0},{"$f":"WINEP_Schemes!G10","v":0},{"$f":"WINEP_Schemes!H10","v":0},{"$f":"WINEP_Schemes!J10","v":0},{"$f":"WINEP_Schemes!I10","v":0},{"$f":"WINEP_Schemes!K10","v":0},{"$f":"WINEP_Schemes!L10","v":0},{"$f":"WINEP_Schemes!M10","v":0},{"$f":"WINEP_Schemes!N10","v":0},{"$f":" I11 * J11 * G11","v":0},{"$f":" N11 * O11","v":0},{"$f":" IF(L11 = 0, P11, (N11 - 1) * O11)","v":0},{"$f":" IF($M11 = R$9, $Q11, 0)","v":0},{"$f":" IF($M11 = S$9, $Q11, 0)","v":0},{"$f":" IF($M11 = T$9, $Q11, 0)","v":0},{"$f":" IF($M11 = U$9, $Q11, 0)","v":0},{"$f":" IF($M11 = V$9, $Q11, 0)","v":0}]
[null,null,{"$f":"WINEP_Schemes!C11","v":"EMD00014"},{"$f":"WINEP_Schemes!D11","v":"7AW100070"},{"$f":"WINEP_Schemes!E11","v":"River Idle from Maun/Poulter to Tiln (Ordsall BOREHOLES 1,2 and Whisker Hill)"},{"$f":"WINEP_Schemes!F11","v":0},{"$f":"WINEP_Schemes!G11","v":0},{"$f":"WINEP_Schemes!H11","v":0},{"$f":"WINEP_Schemes!J11","v":0},{"$f":"WINEP_Schemes!I11","v":0},{"$f":"WINEP_Schemes!K11","v":0},{"$f":"WINEP_Schemes!L11","v":0},{"$f":"WINEP_Schemes!M11","v":0},{"$f":"WINEP_Schemes!N11","v":0},{"$f":" I12 * J12 * G12","v":0},{"$f":" N12 * O12","v":0},{"$f":" IF(L12 = 0, P12, (N12 - 1) * O12)","v":0},{"$f":" IF($M12 = R$9, $Q12, 0)","v":0},0,0,0,0]
[null,null,{"$f":"WINEP_Schemes!C12","v":"EMD00015"},{"$f":"WINEP_Schemes!D12","v":"7AW100070"},{"$f":"WINEP_Schemes!E12","v":"River Idle from Maun/Poulter to Tiln (Grove BOREHOLES 1,2,3,4)"},{"$f":"WINEP_Schemes!F12","v":0},{"$f":"WINEP_Schemes!G12","v":0},{"$f":"WINEP_Schemes!H12","v":0},{"$f":"WINEP_Schemes!J12","v":0},{"$f":"WINEP_Schemes!I12","v":0},{"$f":"WINEP_Schemes!K12","v":0},{"$f":"WINEP_Schemes!L12","v":0},{"$f":"WINEP_Schemes!M12","v":0},{"$f":"WINEP_Schemes!N12","v":0},{"$f":" I13 * J13 * G13","v":0},{"$f":" N13 * O13","v":0},{"$f":" IF(L13 = 0, P13, (N13 - 1) * O13)","v":0},0,0,0,0,0]
[null,null,{"$f":"WINEP_Schemes!C13","v":"EMD00016"},{"$f":"WINEP_Schemes!D13","v":"7AW100071"},{"$f":"WINEP_Schemes!E13","v":"Idle from Ryton to Trent - Everton boreholes (1,2,3,4,5,6)"},{"$f":"WINEP_Schemes!F13","v":0},{"$f":"WINEP_Schemes!G13","v":0},{"$f":"WINEP_Schemes!H13","v":0},{"$f":"WINEP_Schemes!J13","v":0},{"$f":"WINEP_Schemes!I13","v":0},{"$f":"WINEP_Schemes!K13","v":0},{"$f":"WINEP_Schemes!L13","v":0},{"$f":"WINEP_Schemes!M13","v":0},{"$f":"WINEP_Schemes!N13","v":0},{"$f":" I14 * J14 * G14","v":0},{"$f":" N14 * O14","v":0},{"$f":" IF(L14 = 0, P14, (N14 - 1) * O14)","v":0},0,0,0,0,0]
[null,null,{"$f":"WINEP_Schemes!C14","v":"EAN00363"},{"$f":"WINEP_Schemes!D14","v":"7AW100085"},{"$f":"WINEP_Schemes!E14","v":"Implementation Scheme: Undertake river restoration to mitigate the effects of abstraction. The river restoration project will be planned to ensure good biosecurity practices are observed, pathways of spread of invasive species are mitigated and the resultant project brings about biodiversity enhancements."},{"$f":"WINEP_Schemes!F14","v":"£m"},{"$f":"WINEP_Schemes!G14","v":1},{"$f":"WINEP_Schemes!H14","v":0},{"$f":"WINEP_Schemes!J14","v":1},{"$f":"WINEP_Schemes!I14","v":0.109},{"$f":"WINEP_Schemes!K14","v":1},{"$f":"WINEP_Schemes!L14","v":1},{"$f":"WINEP_Schemes!M14","v":"WR"},{"$f":"WINEP_Schemes!N14","v":1},0.109,0.109,0,0,0,0,0,0]
[null,null,{"$f":"WINEP_Schemes!C15","v":"EAN00364"},{"$f":"WINEP_Schemes!D15","v":"7AW100085"},{"$f":"WINEP_Schemes!E15","v":"Implementation Scheme: Undertake river restoration to mitigate the effects of abstraction. The river restoration project will be planned to ensure good biosecurity practices are observed, pathways of spread of invasive species are mitigated and the resultant project brings about biodiversity enhancements."},{"$f":"WINEP_Schemes!F15","v":"£m"},{"$f":"WINEP_Schemes!G15","v":1},{"$f":"WINEP_Schemes!H15","v":0},{"$f":"WINEP_Schemes!J15","v":1},{"$f":"WINEP_Schemes!I15","v":0.312},{"$f":"WINEP_Schemes!K15","v":1},{"$f":"WINEP_Schemes!L15","v":1},{"$f":"WINEP_Schemes!M15","v":"WR"},{"$f":"WINEP_Schemes!N15","v":1},0.312,0.312,0,0,0,0,0,0]
[null,null,{"$f":"WINEP_Schemes!C16","v":"EAN00365"},{"$f":"WINEP_Schemes!D16","v":"7AW100085"},{"$f":"WINEP_Schemes!E16","v":"Implementation Scheme: Undertake river restoration to mitigate the effects of abstraction. The river restoration project will be planned to ensure good biosecurity practices are observed, pathways of spread of invasive species are mitigated and the resultant project brings about biodiversity enhancements."},{"$f":"WINEP_Schemes!F16","v":"£m"},{"$f":"WINEP_Schemes!G16","v":1},{"$f":"WINEP_Schemes!H16","v":0},{"$f":"WINEP_Schemes!J16","v":1},{"$f":"WINEP_Schemes!I16","v":0.33300000000000002},{"$f":"WINEP_Schemes!K16","v":1},{"$f":"WINEP_Schemes!L16","v":1},{"$f":"WINEP_Schemes!M16","v":"WR"},{"$f":"WINEP_Schemes!N16","v":1},{"$f":" I17 * J17 * G17","v":0.33300000000000002},{"$f":" N17 * O17","v":0.33300000000000002},{"$f":" IF(L17 = 0, P17, (N17 - 1) * O17)","v":0},0,0,0,0,0]
[null,null,{"$f":"WINEP_Schemes!C17","v":"EAN00109"},{"$f":"WINEP_Schemes!D17","v":"7AW100086"},{"$f":"WINEP_Schemes!E17","v":"Birchmoor"},{"$f":"WINEP_Schemes!F17","v":"£m"},{"$f":"WINEP_Schemes!G17","v":1},{"$f":"WINEP_Schemes!H17","v":0},{"$f":"WINEP_Schemes!J17","v":1},{"$f":"WINEP_Schemes!I17","v":1.3959999999999999},{"$f":"WINEP_Schemes!K17","v":1},{"$f":"WINEP_Schemes!L17","v":1},{"$f":"WINEP_Schemes!M17","v":"WR"},{"$f":"WINEP_Schemes!N17","v":1},1.3959999999999999,1.3959999999999999,0,0,0,0,0,0]
[null,null,{"$f":"WINEP_Schemes!C18","v":"EAN00359"},{"$f":"WINEP_Schemes!D18","v":"7AW100086"},{"$f":"WINEP_Schemes!E18","v":"Implementation Scheme: Undertake river restoration to mitigate the effects of abstraction. The river restoration project will be planned to ensure good biosecurity practices are observed, pathways of spread of invasive species are mitigated and the resultant project brings about biodiversity enhancements."},{"$f":"WINEP_Schemes!F18","v":"£m"},{"$f":"WINEP_Schemes!G18","v":1},{"$f":"WINEP_Schemes!H18","v":0},{"$f":"WINEP_Schemes!J18","v":1},{"$f":"WINEP_Schemes!I18","v":9.8000000000000004E-2},{"$f":"WINEP_Schemes!K18","v":1},{"$f":"WINEP_Schemes!L18","v":1},{"$f":"WINEP_Schemes!M18","v":"WR"},{"$f":"WINEP_Schemes!N18","v":1},9.8000000000000004E-2,9.8000000000000004E-2,0,0,0,0,0,0]
[null,null,{"$f":"WINEP_Schemes!C19","v":"EAN02383"},{"$f":"WINEP_Schemes!D19","v":"7AW100087"},{"$f":"WINEP_Schemes!E19","v":"Implementation Scheme: Undertake river restoration to mitigate the effects of abstraction. The river restoration project will be planned to ensure good biosecurity practices are observed, pathways of spread of invasive species are mitigated and the resultant project brings about biodiversity enhancements."},{"$f":"WINEP_Schemes!F19","v":"£m"},{"$f":"WINEP_Schemes!G19","v":1},{"$f":"WINEP_Schemes!H19","v":0},{"$f":"WINEP_Schemes!J19","v":1},{"$f":"WINEP_Schemes!I19","v":0.59499999999999997},{"$f":"WINEP_Schemes!K19","v":1},{"$f":"WINEP_Schemes!L19","v":1},{"$f":"WINEP_Schemes!M19","v":"WR"},{"$f":"WINEP_Schemes!N19","v":1},0.59499999999999997,0.59499999999999997,0,0,0,0,0,0]
[null,null,{"$f":"WINEP_Schemes!C20","v":"EAN02384"},{"$f":"WINEP_Schemes!D20","v":"7AW100087"},{"$f":"WINEP_Schemes!E20","v":"Implementation Scheme: Undertake river restoration to mitigate the effects of abstraction. The river restoration project will be planned to ensure good biosecurity practices are observed, pathways of spread of invasive species are mitigated and the resultant project brings about biodiversity enhancements."},{"$f":"WINEP_Schemes!F20","v":"£m"},{"$f":"WINEP_Schemes!G20","v":1},{"$f":"WINEP_Schemes!H20","v":0},{"$f":"WINEP_Schemes!J20","v":1},{"$f":"WINEP_Schemes!I20","v":0.626},{"$f":"WINEP_Schemes!K20","v":1},{"$f":"WINEP_Schemes!L20","v":1},{"$f":"WINEP_Schemes!M20","v":"WR"},{"$f":"WINEP_Schemes!N20","v":1},0.626,0.626,0,0,0,0,0,0]
[null,null,{"$f":"WINEP_Schemes!C21","v":"EAN00114"},{"$f":"WINEP_Schemes!D21","v":"7AW100088"},{"$f":"WINEP_Schemes!E21","v":"Isleham"},{"$f":"WINEP_Schemes!F21","v":"£m"},{"$f":"WINEP_Schemes!G21","v":1},{"$f":"WINEP_Schemes!H21","v":0},{"$f":"WINEP_Schemes!J21","v":1},{"$f":"WINEP_Schemes!I21","v":1.55},{"$f":"WINEP_Schemes!K21","v":1},{"$f":"WINEP_Schemes!L21","v":1},{"$f":"WINEP_Schemes!M21","v":"WR"},{"$f":"WINEP_Schemes!N21","v":1},1.55,1.55,0,0,0,0,0,0]
[null,null,{"$f":"WINEP_Schemes!C22","v":"EAN00361"},{"$f":"WINEP_Schemes!D22","v":"7AW100088"},{"$f":"WINEP_Schemes!E22","v":"Implementation Scheme: Undertake river restoration to mitigate the effects of abstraction. The river restoration project will be planned to ensure good biosecurity practices are observed, pathways of spread of invasive species are mitigated and the resultant project brings about biodiversity enhancements."},{"$f":"WINEP_Schemes!F22","v":"£m"},{"$f":"WINEP_Schemes!G22","v":1},{"$f":"WINEP_Schemes!H22","v":0},{"$f":"WINEP_Schemes!J22","v":1},{"$f":"WINEP_Schemes!I22","v":0.308},{"$f":"WINEP_Schemes!K22","v":1},{"$f":"WINEP_Schemes!L22","v":1},{"$f":"WINEP_Schemes!M22","v":"WR"},{"$f":"WINEP_Schemes!N22","v":1},0.308,0.308,0,0,0,0,0,0]
[null,null,{"$f":"WINEP_Schemes!C23","v":"EAN00129"},{"$f":"WINEP_Schemes!D23","v":"7AW100090"},{"$f":"WINEP_Schemes!E23","v":"Rushbrooke"},{"$f":"WINEP_Schemes!F23","v":"£m"},{"$f":"WINEP_Schemes!G23","v":1},{"$f":"WINEP_Schemes!H23","v":0},{"$f":"WINEP_Schemes!J23","v":1},{"$f":"WINEP_Schemes!I23","v":1.1339999999999999},{"$f":"WINEP_Schemes!K23","v":1},{"$f":"WINEP_Schemes!L23","v":1},{"$f":"WINEP_Schemes!M23","v":"WR"},{"$f":"WINEP_Schemes!N23","v":1},1.1339999999999999,1.1339999999999999,0,0,0,0,0,0]
[null,null,{"$f":"WINEP_Schemes!C24","v":"EAN00360"},{"$f":"WINEP_Schemes!D24","v":"7AW100090"},{"$f":"WINEP_Schemes!E24","v":"Implementation Scheme: Undertake river restoration to mitigate the effects of abstraction. The river restoration project will be planned to ensure good biosecurity practices are observed, pathways of spread of invasive species are mitigated and the resultant project brings about biodiversity enhancements."},{"$f":"WINEP_Schemes!F24","v":"£m"},{"$f":"WINEP_Schemes!G24","v":1},{"$f":"WINEP_Schemes!H24","v":0},{"$f":"WINEP_Schemes!J24","v":1},{"$f":"WINEP_Schemes!I24","v":0.317},{"$f":"WINEP_Schemes!K24","v":1},{"$f":"WINEP_Schemes!L24","v":1},{"$f":"WINEP_Schemes!M24","v":"WR"},{"$f":"WINEP_Schemes!N24","v":1},0.317,0.317,0,0,0,0,0,0]
[null,null,{"$f":"WINEP_Schemes!C25","v":"EAN00366"},{"$f":"WINEP_Schemes!D25","v":"7AW100091"},{"$f":"WINEP_Schemes!E25","v":"Implementation Scheme: Undertake river restoration to mitigate the effects of abstraction. The river restoration project will be planned to ensure good biosecurity practices are observed, pathways of spread of invasive species are mitigated and the resultant project brings about biodiversity enhancements."},{"$f":"WINEP_Schemes!F25","v":"£m"},{"$f":"WINEP_Schemes!G25","v":1},{"$f":"WINEP_Schemes!H25","v":0},{"$f":"WINEP_Schemes!J25","v":1},{"$f":"WINEP_Schemes!I25","v":0.45800000000000002},{"$f":"WINEP_Schemes!K25","v":1},{"$f":"WINEP_Schemes!L25","v":1},{"$f":"WINEP_Schemes!M25","v":"WR"},{"$f":"WINEP_Schemes!N25","v":1},0.45800000000000002,0.45800000000000002,0,0,0,0,0,0]
[null,null,{"$f":"WINEP_Schemes!C26","v":"EAN00367"},{"$f":"WINEP_Schemes!D26","v":"7AW100092"},{"$f":"WINEP_Schemes!E26","v":"Implementation Scheme: Undertake river restoration to mitigate the effects of abstraction. The river restoration project will be planned to ensure good biosecurity practices are observed, pathways of spread of invasive species are mitigated and the resultant project brings about biodiversity enhancements."},{"$f":"WINEP_Schemes!F26","v":"£m"},{"$f":"WINEP_Schemes!G26","v":1},{"$f":"WINEP_Schemes!H26","v":0},{"$f":"WINEP_Schemes!J26","v":1},{"$f":"WINEP_Schemes!I26","v":0.31},{"$f":"WINEP_Schemes!K26","v":1},{"$f":"WINEP_Schemes!L26","v":1},{"$f":"WINEP_Schemes!M26","v":"WR"},{"$f":"WINEP_Schemes!N26","v":1},0.31,0.31,0,0,0,0,0,0]
[null,null,{"$f":"WINEP_Schemes!C27","v":"EAN00133"},{"$f":"WINEP_Schemes!D27","v":"7AW100093"},{"$f":"WINEP_Schemes!E27","v":"Stanton/Ixworth"},{"$f":"WINEP_Schemes!F27","v":"£m"},{"$f":"WINEP_Schemes!G27","v":1},{"$f":"WINEP_Schemes!H27","v":0},{"$f":"WINEP_Schemes!J27","v":1},{"$f":"WINEP_Schemes!I27","v":0.72799999999999998},{"$f":"WINEP_Schemes!K27","v":1},{"$f":"WINEP_Schemes!L27","v":1},{"$f":"WINEP_Schemes!M27","v":"WR"},{"$f":"WINEP_Schemes!N27","v":1},0.72799999999999998,0.72799999999999998,0,{"$f":" IF($M28 = R$9, $Q28, 0)","v":0},0,0,0,0]
[null,null,{"$f":"WINEP_Schemes!C28","v":"EAN02388"},{"$f":"WINEP_Schemes!D28","v":"7AW100093"},{"$f":"WINEP_Schemes!E28","v":"Implementation Scheme: Undertake river restoration to mitigate the effects of abstraction. The river restoration project will be planned to ensure good biosecurity practices are observed, pathways of spread of invasive species are mitigated and the resultant project brings about biodiversity enhancements."},{"$f":"WINEP_Schemes!F28","v":"£m"},{"$f":"WINEP_Schemes!G28","v":1},{"$f":"WINEP_Schemes!H28","v":0},{"$f":"WINEP_Schemes!J28","v":1},{"$f":"WINEP_Schemes!I28","v":0.39500000000000002},{"$f":"WINEP_Schemes!K28","v":1},{"$f":"WINEP_Schemes!L28","v":1},{"$f":"WINEP_Schemes!M28","v":"WR"},{"$f":"WINEP_Schemes!N28","v":1},0.39500000000000002,0.39500000000000002,0,0,0,0,0,0]
[null,null,{"$f":"WINEP_Schemes!C29","v":"EAN02389"},{"$f":"WINEP_Schemes!D29","v":"7AW100093"},{"$f":"WINEP_Schemes!E29","v":"Implementation Scheme: Undertake river restoration to mitigate the effects of abstraction. The river restoration project will be planned to ensure good biosecurity practices are observed, pathways of spread of invasive species are mitigated and the resultant project brings about biodiversity enhancements."},{"$f":"WINEP_Schemes!F29","v":"£m"},{"$f":"WINEP_Schemes!G29","v":1},{"$f":"WINEP_Schemes!H29","v":0},{"$f":"WINEP_Schemes!J29","v":1},{"$f":"WINEP_Schemes!I29","v":0.441},{"$f":"WINEP_Schemes!K29","v":1},{"$f":"WINEP_Schemes!L29","v":1},{"$f":"WINEP_Schemes!M29","v":"WR"},{"$f":"WINEP_Schemes!N29","v":1},0.441,0.441,0,0,0,0,0,0]
[null,null,{"$f":"WINEP_Schemes!C30","v":"EAN02390"},{"$f":"WINEP_Schemes!D30","v":"7AW100093"},{"$f":"WINEP_Schemes!E30","v":"Stanton/Ixworth"},{"$f":"WINEP_Schemes!F30","v":"£m"},{"$f":"WINEP_Schemes!G30","v":1},{"$f":"WINEP_Schemes!H30","v":0},{"$f":"WINEP_Schemes!J30","v":1},{"$f":"WINEP_Schemes!I30","v":0.41099999999999998},{"$f":"WINEP_Schemes!K30","v":1},{"$f":"WINEP_Schemes!L30","v":1},{"$f":"WINEP_Schemes!M30","v":"WR"},{"$f":"WINEP_Schemes!N30","v":1},0.41099999999999998,0.41099999999999998,0,0,0,0,0,0]
[null,null,{"$f":"WINEP_Schemes!C31","v":"EAN02414"},{"$f":"WINEP_Schemes!D31","v":"7AW100093"},{"$f":"WINEP_Schemes!E31","v":"Stanton/Ixworth"},{"$f":"WINEP_Schemes!F31","v":"£m"},{"$f":"WINEP_Schemes!G31","v":1},{"$f":"WINEP_Schemes!H31","v":0},{"$f":"WINEP_Schemes!J31","v":1},{"$f":"WINEP_Schemes!I31","v":0.41099999999999998},{"$f":"WINEP_Schemes!K31","v":1},{"$f":"WINEP_Schemes!L31","v":1},{"$f":"WINEP_Schemes!M31","v":"WR"},{"$f":"WINEP_Schemes!N31","v":1},0.41099999999999998,0.41099999999999998,0,0,0,0,0,0]
[null,null,{"$f":"WINEP_Schemes!C32","v":"EAN00136"},{"$f":"WINEP_Schemes!D32","v":"7AW100270"},{"$f":"WINEP_Schemes!E32","v":"WEST RUNTON COMMON / West Runton, Sheringham"},{"$f":"WINEP_Schemes!F32","v":"£m"},{"$f":"WINEP_Schemes!G32","v":1},{"$f":"WINEP_Schemes!H32","v":0},{"$f":"WINEP_Schemes!J32","v":1},{"$f":"WINEP_Schemes!I32","v":0.48399999999999999},{"$f":"WINEP_Schemes!K32","v":1},{"$f":"WINEP_Schemes!L32","v":1},{"$f":"WINEP_Schemes!M32","v":"WR"},{"$f":"WINEP_Schemes!N32","v":1},0.48399999999999999,0.48399999999999999,0,0,0,0,0,0]
[null,null,{"$f":"WINEP_Schemes!C33","v":"EAN00138"},{"$f":"WINEP_Schemes!D33","v":"7AW100272"},{"$f":"WINEP_Schemes!E33","v":"TIFFEY / High Oak"},{"$f":"WINEP_Schemes!F33","v":"£m"},{"$f":"WINEP_Schemes!G33","v":1},{"$f":"WINEP_Schemes!H33","v":0},{"$f":"WINEP_Schemes!J33","v":1},{"$f":"WINEP_Schemes!I33","v":1.125},{"$f":"WINEP_Schemes!K33","v":1},{"$f":"WINEP_Schemes!L33","v":1},{"$f":"WINEP_Schemes!M33","v":"WR"},{"$f":"WINEP_Schemes!N33","v":1},1.125,1.125,0,0,0,0,0,0]
[null,null,{"$f":"WINEP_Schemes!C34","v":"EAN00139"},{"$f":"WINEP_Schemes!D34","v":"7AW100272"},{"$f":"WINEP_Schemes!E34","v":"TIFFEY / High Oak"},{"$f":"WINEP_Schemes!F34","v":"£m"},{"$f":"WINEP_Schemes!G34","v":1},{"$f":"WINEP_Schemes!H34","v":0},{"$f":"WINEP_Schemes!J34","v":1},{"$f":"WINEP_Schemes!I34","v":1.125},{"$f":"WINEP_Schemes!K34","v":1},{"$f":"WINEP_Schemes!L34","v":1},{"$f":"WINEP_Schemes!M34","v":"WR"},{"$f":"WINEP_Schemes!N34","v":1},1.125,1.125,0,0,0,0,0,0]
[null,null,{"$f":"WINEP_Schemes!C35","v":"EAN00140"},{"$f":"WINEP_Schemes!D35","v":"7AW100273"},{"$f":"WINEP_Schemes!E35","v":"BRETT / Semer, Raydon"},{"$f":"WINEP_Schemes!F35","v":0},{"$f":"WINEP_Schemes!G35","v":0},{"$f":"WINEP_Schemes!H35","v":0},{"$f":"WINEP_Schemes!J35","v":0},{"$f":"WINEP_Schemes!I35","v":0},{"$f":"WINEP_Schemes!K35","v":0},{"$f":"WINEP_Schemes!L35","v":0},{"$f":"WINEP_Schemes!M35","v":0},{"$f":"WINEP_Schemes!N35","v":0},0,0,0,0,0,0,0,0]
[null,null,{"$f":"WINEP_Schemes!C36","v":"EAN02422"},{"$f":"WINEP_Schemes!D36","v":"7AW100273"},{"$f":"WINEP_Schemes!E36","v":"BRETT / Semer, Raydon"},{"$f":"WINEP_Schemes!F36","v":0},{"$f":"WINEP_Schemes!G36","v":0},{"$f":"WINEP_Schemes!H36","v":0},{"$f":"WINEP_Schemes!J36","v":0},{"$f":"WINEP_Schemes!I36","v":0},{"$f":"WINEP_Schemes!K36","v":0},{"$f":"WINEP_Schemes!L36","v":0},{"$f":"WINEP_Schemes!M36","v":0},{"$f":"WINEP_Schemes!N36","v":0},0,0,0,0,0,0,0,0]
[null,null,{"$f":"WINEP_Schemes!C37","v":"LNA00001"},{"$f":"WINEP_Schemes!D37","v":"7AW101744"},{"$f":"WINEP_Schemes!E37","v":"BARNOLDBY - BORES A - D"},{"$f":"WINEP_Schemes!F37","v":"£m"},{"$f":"WINEP_Schemes!G37","v":1},{"$f":"WINEP_Schemes!H37","v":0},{"$f":"WINEP_Schemes!J37","v":1},{"$f":"WINEP_Schemes!I37","v":0.217},{"$f":"WINEP_Schemes!K37","v":1},{"$f":"WINEP_Schemes!L37","v":1},{"$f":"WINEP_Schemes!M37","v":"WR"},{"$f":"WINEP_Schemes!N37","v":1},0.217,0.217,0,0,0,0,0,0]
[null,null,{"$f":"WINEP_Schemes!C38","v":"LNA00002"},{"$f":"WINEP_Schemes!D38","v":"7AW101744"},{"$f":"WINEP_Schemes!E38","v":"WEELSBY BORES A - E"},{"$f":"WINEP_Schemes!F38","v":"£m"},{"$f":"WINEP_Schemes!G38","v":1},{"$f":"WINEP_Schemes!H38","v":0},{"$f":"WINEP_Schemes!J38","v":1},{"$f":"WINEP_Schemes!I38","v":0.217},{"$f":"WINEP_Schemes!K38","v":1},{"$f":"WINEP_Schemes!L38","v":1},{"$f":"WINEP_Schemes!M38","v":"WR"},{"$f":"WINEP_Schemes!N38","v":1},0.217,0.217,0,0,0,0,0,0]
[null,null,{"$f":"WINEP_Schemes!C39","v":"LNA00027"},{"$f":"WINEP_Schemes!D39","v":"7AW101744"},{"$f":"WINEP_Schemes!E39","v":"TETNEY"},{"$f":"WINEP_Schemes!F39","v":"£m"},{"$f":"WINEP_Schemes!G39","v":1},{"$f":"WINEP_Schemes!H39","v":0},{"$f":"WINEP_Schemes!J39","v":1},{"$f":"WINEP_Schemes!I39","v":0.217},{"$f":"WINEP_Schemes!K39","v":1},{"$f":"WINEP_Schemes!L39","v":1},{"$f":"WINEP_Schemes!M39","v":"WR"},{"$f":"WINEP_Schemes!N39","v":1},0.217,0.217,0,0,0,0,0,0]
[null,null,{"$f":"WINEP_Schemes!C40","v":"LNA00028"},{"$f":"WINEP_Schemes!D40","v":"7AW101744"},{"$f":"WINEP_Schemes!E40","v":"FULSTOW - BORES 1 -2"},{"$f":"WINEP_Schemes!F40","v":"£m"},{"$f":"WINEP_Schemes!G40","v":1},{"$f":"WINEP_Schemes!H40","v":0},{"$f":"WINEP_Schemes!J40","v":1},{"$f":"WINEP_Schemes!I40","v":0.217},{"$f":"WINEP_Schemes!K40","v":1},{"$f":"WINEP_Schemes!L40","v":1},{"$f":"WINEP_Schemes!M40","v":"WR"},{"$f":"WINEP_Schemes!N40","v":1},0.217,0.217,0,0,0,0,0,0]
[null,null,{"$f":"WINEP_Schemes!C41","v":"LNA00033"},{"$f":"WINEP_Schemes!D41","v":"7AW101744"},{"$f":"WINEP_Schemes!E41","v":"HABROUGH - BORES 1 -3"},{"$f":"WINEP_Schemes!F41","v":"£m"},{"$f":"WINEP_Schemes!G41","v":1},{"$f":"WINEP_Schemes!H41","v":0},{"$f":"WINEP_Schemes!J41","v":1},{"$f":"WINEP_Schemes!I41","v":0.217},{"$f":"WINEP_Schemes!K41","v":1},{"$f":"WINEP_Schemes!L41","v":1},{"$f":"WINEP_Schemes!M41","v":"WR"},{"$f":"WINEP_Schemes!N41","v":1},0.217,0.217,0,0,0,0,0,0]
[null,null,{"$f":"WINEP_Schemes!C42","v":"LNA00034"},{"$f":"WINEP_Schemes!D42","v":"7AW101744"},{"$f":"WINEP_Schemes!E42","v":"LITTLE LONDON - BORES 1 - 4"},{"$f":"WINEP_Schemes!F42","v":"£m"},{"$f":"WINEP_Schemes!G42","v":1},{"$f":"WINEP_Schemes!H42","v":0},{"$f":"WINEP_Schemes!J42","v":1},{"$f":"WINEP_Schemes!I42","v":0.217},{"$f":"WINEP_Schemes!K42","v":1},{"$f":"WINEP_Schemes!L42","v":1},{"$f":"WINEP_Schemes!M42","v":"WR"},{"$f":"WINEP_Schemes!N42","v":1},0.217,0.217,0,0,0,0,0,0]
[null,null,{"$f":"WINEP_Schemes!C43","v":"LNA00035"},{"$f":"WINEP_Schemes!D43","v":"7AW101744"},{"$f":"WINEP_Schemes!E43","v":"HEALING - BORES A-F"},{"$f":"WINEP_Schemes!F43","v":"£m"},{"$f":"WINEP_Schemes!G43","v":1},{"$f":"WINEP_Schemes!H43","v":0},{"$f":"WINEP_Schemes!J43","v":1},{"$f":"WINEP_Schemes!I43","v":0.217},{"$f":"WINEP_Schemes!K43","v":1},{"$f":"WINEP_Schemes!L43","v":1},{"$f":"WINEP_Schemes!M43","v":"WR"},{"$f":"WINEP_Schemes!N43","v":1},0.217,0.217,0,0,0,0,0,0]
[null,null,{"$f":"WINEP_Schemes!C44","v":"LNA00036"},{"$f":"WINEP_Schemes!D44","v":"7AW101744"},{"$f":"WINEP_Schemes!E44","v":"THORNTON CURTIS - BORES 1-3"},{"$f":"WINEP_Schemes!F44","v":"£m"},{"$f":"WINEP_Schemes!G44","v":1},{"$f":"WINEP_Schemes!H44","v":0},{"$f":"WINEP_Schemes!J44","v":1},{"$f":"WINEP_Schemes!I44","v":0.217},{"$f":"WINEP_Schemes!K44","v":1},{"$f":"WINEP_Schemes!L44","v":1},{"$f":"WINEP_Schemes!M44","v":"WR"},{"$f":"WINEP_Schemes!N44","v":1},0.217,0.217,0,0,0,0,0,0]
[null,null,{"$f":"WINEP_Schemes!C45","v":"LNA00037"},{"$f":"WINEP_Schemes!D45","v":"7AW101744"},{"$f":"WINEP_Schemes!E45","v":"BARROW BORES 1 - 7"},{"$f":"WINEP_Schemes!F45","v":"£m"},{"$f":"WINEP_Schemes!G45","v":1},{"$f":"WINEP_Schemes!H45","v":0},{"$f":"WINEP_Schemes!J45","v":1},{"$f":"WINEP_Schemes!I45","v":0.217},{"$f":"WINEP_Schemes!K45","v":1},{"$f":"WINEP_Schemes!L45","v":1},{"$f":"WINEP_Schemes!M45","v":"WR"},{"$f":"WINEP_Schemes!N45","v":1},0.217,0.217,0,0,0,0,0,0]
[null,null,{"$f":"WINEP_Schemes!C46","v":"LNA00038"},{"$f":"WINEP_Schemes!D46","v":"7AW101744"},{"$f":"WINEP_Schemes!E46","v":"BARTON - BORES 1 -3"},{"$f":"WINEP_Schemes!F46","v":"£m"},{"$f":"WINEP_Schemes!G46","v":1},{"$f":"WINEP_Schemes!H46","v":0},{"$f":"WINEP_Schemes!J46","v":1},{"$f":"WINEP_Schemes!I46","v":0.217},{"$f":"WINEP_Schemes!K46","v":1},{"$f":"WINEP_Schemes!L46","v":1},{"$f":"WINEP_Schemes!M46","v":"WR"},{"$f":"WINEP_Schemes!N46","v":1},0.217,0.217,0,0,0,0,0,0]
[null,null,{"$f":"WINEP_Schemes!C47","v":"LNA00039"},{"$f":"WINEP_Schemes!D47","v":"7AW101744"},{"$f":"WINEP_Schemes!E47","v":"ULCEBY - BORES 1 - 3"},{"$f":"WINEP_Schemes!F47","v":"£m"},{"$f":"WINEP_Schemes!G47","v":1},{"$f":"WINEP_Schemes!H47","v":0},{"$f":"WINEP_Schemes!J47","v":1},{"$f":"WINEP_Schemes!I47","v":0.217},{"$f":"WINEP_Schemes!K47","v":1},{"$f":"WINEP_Schemes!L47","v":1},{"$f":"WINEP_Schemes!M47","v":"WR"},{"$f":"WINEP_Schemes!N47","v":1},0.217,0.217,0,0,0,0,0,0]
[null,null,{"$f":"WINEP_Schemes!C48","v":"LNA00040"},{"$f":"WINEP_Schemes!D48","v":"7AW101744"},{"$f":"WINEP_Schemes!E48","v":"GOXHILL"},{"$f":"WINEP_Schemes!F48","v":"£m"},{"$f":"WINEP_Schemes!G48","v":1},{"$f":"WINEP_Schemes!H48","v":0},{"$f":"WINEP_Schemes!J48","v":1},{"$f":"WINEP_Schemes!I48","v":0.217},{"$f":"WINEP_Schemes!K48","v":1},{"$f":"WINEP_Schemes!L48","v":1},{"$f":"WINEP_Schemes!M48","v":"WR"},{"$f":"WINEP_Schemes!N48","v":1},0.217,0.217,0,0,0,0,0,0]
[null,null,{"$f":"WINEP_Schemes!C49","v":"LNA00029"},{"$f":"WINEP_Schemes!D49","v":"7AW101750"},{"$f":"WINEP_Schemes!E49","v":"WELTON BORES 6 - 10"},{"$f":"WINEP_Schemes!F49","v":"£m"},{"$f":"WINEP_Schemes!G49","v":1},{"$f":"WINEP_Schemes!H49","v":0},{"$f":"WINEP_Schemes!J49","v":1},{"$f":"WINEP_Schemes!I49","v":0.47},{"$f":"WINEP_Schemes!K49","v":1},{"$f":"WINEP_Schemes!L49","v":1},{"$f":"WINEP_Schemes!M49","v":"WR"},{"$f":"WINEP_Schemes!N49","v":1},0.47,0.47,0,0,0,0,0,0]
[null,null,{"$f":"WINEP_Schemes!C50","v":"LNA00032"},{"$f":"WINEP_Schemes!D50","v":"7AW101750"},{"$f":"WINEP_Schemes!E50","v":"NEW BOREHOLE - SPRIDLINGTON 11"},{"$f":"WINEP_Schemes!F50","v":"£m"},{"$f":"WINEP_Schemes!G50","v":1},{"$f":"WINEP_Schemes!H50","v":0},{"$f":"WINEP_Schemes!J50","v":1},{"$f":"WINEP_Schemes!I50","v":0.47},{"$f":"WINEP_Schemes!K50","v":1},{"$f":"WINEP_Schemes!L50","v":1},{"$f":"WINEP_Schemes!M50","v":"WR"},{"$f":"WINEP_Schemes!N50","v":1},0.47,0.47,0,0,0,0,0,0]
[null,null,{"$f":"WINEP_Schemes!C51","v":"LNA00007"},{"$f":"WINEP_Schemes!D51","v":"7AW101752"},{"$f":"WINEP_Schemes!E51","v":"BILLINGBOROUGH - BORES A - D"},{"$f":"WINEP_Schemes!F51","v":"£m"},{"$f":"WINEP_Schemes!G51","v":1},{"$f":"WINEP_Schemes!H51","v":0},{"$f":"WINEP_Schemes!J51","v":1},{"$f":"WINEP_Schemes!I51","v":0.86099999999999999},{"$f":"WINEP_Schemes!K51","v":1},{"$f":"WINEP_Schemes!L51","v":1},{"$f":"WINEP_Schemes!M51","v":"WR"},{"$f":"WINEP_Schemes!N51","v":1},0.86099999999999999,0.86099999999999999,0,0,0,0,0,0]
[null,null,{"$f":"WINEP_Schemes!C52","v":"LNA00007"},{"$f":"WINEP_Schemes!D52","v":"7AW101752"},{"$f":"WINEP_Schemes!E52","v":"PINCHBECK Jockey P.S. BOREHOLE 2"},{"$f":"WINEP_Schemes!F52","v":0},{"$f":"WINEP_Schemes!G52","v":0},{"$f":"WINEP_Schemes!H52","v":0},{"$f":"WINEP_Schemes!J52","v":0},{"$f":"WINEP_Schemes!I52","v":0},{"$f":"WINEP_Schemes!K52","v":0},{"$f":"WINEP_Schemes!L52","v":0},{"$f":"WINEP_Schemes!M52","v":0},{"$f":"WINEP_Schemes!N52","v":0},0,0,0,0,0,0,0,0]
[null,null,{"$f":"WINEP_Schemes!C53","v":"LNA00011"},{"$f":"WINEP_Schemes!D53","v":"7AW101752"},{"$f":"WINEP_Schemes!E53","v":"ASLACKBY PUMPING STATION"},{"$f":"WINEP_Schemes!F53","v":0},{"$f":"WINEP_Schemes!G53","v":0},{"$f":"WINEP_Schemes!H53","v":0},{"$f":"WINEP_Schemes!J53","v":0},{"$f":"WINEP_Schemes!I53","v":0},{"$f":"WINEP_Schemes!K53","v":0},{"$f":"WINEP_Schemes!L53","v":0},{"$f":"WINEP_Schemes!M53","v":0},{"$f":"WINEP_Schemes!N53","v":0},0,0,0,0,0,0,0,0]
[null,null,{"$f":"WINEP_Schemes!C54","v":"LNA00012"},{"$f":"WINEP_Schemes!D54","v":"7AW101752"},{"$f":"WINEP_Schemes!E54","v":"RIPPINGALE PUMPING STATION"},{"$f":"WINEP_Schemes!F54","v":0},{"$f":"WINEP_Schemes!G54","v":0},{"$f":"WINEP_Schemes!H54","v":0},{"$f":"WINEP_Schemes!J54","v":0},{"$f":"WINEP_Schemes!I54","v":0},{"$f":"WINEP_Schemes!K54","v":0},{"$f":"WINEP_Schemes!L54","v":0},{"$f":"WINEP_Schemes!M54","v":0},{"$f":"WINEP_Schemes!N54","v":0},0,0,0,0,0,0,0,0]
[null,null,{"$f":"WINEP_Schemes!C55","v":"LNA00013"},{"$f":"WINEP_Schemes!D55","v":"7AW101752"},{"$f":"WINEP_Schemes!E55","v":"SWATON"},{"$f":"WINEP_Schemes!F55","v":0},{"$f":"WINEP_Schemes!G55","v":0},{"$f":"WINEP_Schemes!H55","v":0},{"$f":"WINEP_Schemes!J55","v":0},{"$f":"WINEP_Schemes!I55","v":0},{"$f":"WINEP_Schemes!K55","v":0},{"$f":"WINEP_Schemes!L55","v":0},{"$f":"WINEP_Schemes!M55","v":0},{"$f":"WINEP_Schemes!N55","v":0},0,0,0,0,0,0,0,0]
[null,null,{"$f":"WINEP_Schemes!C56","v":"LNA00020"},{"$f":"WINEP_Schemes!D56","v":"7AW101752"},{"$f":"WINEP_Schemes!E56","v":"DROVE LANE AND CLAY HILL"},{"$f":"WINEP_Schemes!F56","v":0},{"$f":"WINEP_Schemes!G56","v":0},{"$f":"WINEP_Schemes!H56","v":0},{"$f":"WINEP_Schemes!J56","v":0},{"$f":"WINEP_Schemes!I56","v":0},{"$f":"WINEP_Schemes!K56","v":0},{"$f":"WINEP_Schemes!L56","v":0},{"$f":"WINEP_Schemes!M56","v":0},{"$f":"WINEP_Schemes!N56","v":0},0,0,0,0,0,0,0,0]
[null,null,{"$f":"WINEP_Schemes!C57","v":"LNA00021"},{"$f":"WINEP_Schemes!D57","v":"7AW101752"},{"$f":"WINEP_Schemes!E57","v":"ASWARBY"},{"$f":"WINEP_Schemes!F57","v":0},{"$f":"WINEP_Schemes!G57","v":0},{"$f":"WINEP_Schemes!H57","v":0},{"$f":"WINEP_Schemes!J57","v":0},{"$f":"WINEP_Schemes!I57","v":0},{"$f":"WINEP_Schemes!K57","v":0},{"$f":"WINEP_Schemes!L57","v":0},{"$f":"WINEP_Schemes!M57","v":0},{"$f":"WINEP_Schemes!N57","v":0},0,0,0,0,0,0,0,0]
[null,null,{"$f":"WINEP_Schemes!C58","v":"LNA00024"},{"$f":"WINEP_Schemes!D58","v":"7AW101752"},{"$f":"WINEP_Schemes!E58","v":"KIRKBY LA THORPE"},{"$f":"WINEP_Schemes!F58","v":0},{"$f":"WINEP_Schemes!G58","v":0},{"$f":"WINEP_Schemes!H58","v":0},{"$f":"WINEP_Schemes!J58","v":0},{"$f":"WINEP_Schemes!I58","v":0},{"$f":"WINEP_Schemes!K58","v":0},{"$f":"WINEP_Schemes!L58","v":0},{"$f":"WINEP_Schemes!M58","v":0},{"$f":"WINEP_Schemes!N58","v":0},0,0,0,0,0,0,0,0]
[null,null,{"$f":"WINEP_Schemes!C59","v":"LNA00042"},{"$f":"WINEP_Schemes!D59","v":"7AW101752"},{"$f":"WINEP_Schemes!E59","v":"West Pinchbeck"},{"$f":"WINEP_Schemes!F59","v":0},{"$f":"WINEP_Schemes!G59","v":0},{"$f":"WINEP_Schemes!H59","v":0},{"$f":"WINEP_Schemes!J59","v":0},{"$f":"WINEP_Schemes!I59","v":0},{"$f":"WINEP_Schemes!K59","v":0},{"$f":"WINEP_Schemes!L59","v":0},{"$f":"WINEP_Schemes!M59","v":0},{"$f":"WINEP_Schemes!N59","v":0},0,0,0,0,0,0,0,0]
[null,null,{"$f":"WINEP_Schemes!C60","v":"LNA00043"},{"$f":"WINEP_Schemes!D60","v":"7AW101752"},{"$f":"WINEP_Schemes!E60","v":"Haconby"},{"$f":"WINEP_Schemes!F60","v":0},{"$f":"WINEP_Schemes!G60","v":0},{"$f":"WINEP_Schemes!H60","v":0},{"$f":"WINEP_Schemes!J60","v":0},{"$f":"WINEP_Schemes!I60","v":0},{"$f":"WINEP_Schemes!K60","v":0},{"$f":"WINEP_Schemes!L60","v":0},{"$f":"WINEP_Schemes!M60","v":0},{"$f":"WINEP_Schemes!N60","v":0},0,0,0,0,0,0,0,0]
[null,null,{"$f":"WINEP_Schemes!C61","v":"LNA00014"},{"$f":"WINEP_Schemes!D61","v":"7AW101756"},{"$f":"WINEP_Schemes!E61","v":"WILSTHORPE"},{"$f":"WINEP_Schemes!F61","v":"£m"},{"$f":"WINEP_Schemes!G61","v":1},{"$f":"WINEP_Schemes!H61","v":0},{"$f":"WINEP_Schemes!J61","v":1},{"$f":"WINEP_Schemes!I61","v":0.41399999999999998},{"$f":"WINEP_Schemes!K61","v":1},{"$f":"WINEP_Schemes!L61","v":1},{"$f":"WINEP_Schemes!M61","v":"WR"},{"$f":"WINEP_Schemes!N61","v":1},0.41399999999999998,0.41399999999999998,0,0,0,0,0,0]
[null,null,{"$f":"WINEP_Schemes!C62","v":"LNA00016"},{"$f":"WINEP_Schemes!D62","v":"7AW101756"},{"$f":"WINEP_Schemes!E62","v":"BOURNE"},{"$f":"WINEP_Schemes!F62","v":0},{"$f":"WINEP_Schemes!G62","v":0},{"$f":"WINEP_Schemes!H62","v":0},{"$f":"WINEP_Schemes!J62","v":0},{"$f":"WINEP_Schemes!I62","v":0},{"$f":"WINEP_Schemes!K62","v":0},{"$f":"WINEP_Schemes!L62","v":0},{"$f":"WINEP_Schemes!M62","v":0},{"$f":"WINEP_Schemes!N62","v":0},0,0,0,0,0,0,0,0]
[null,null,{"$f":"WINEP_Schemes!C63","v":"LNA00099"},{"$f":"WINEP_Schemes!D63","v":"7AW101757"},{"$f":"WINEP_Schemes!E63","v":"WILSTHORPE"},{"$f":"WINEP_Schemes!F63","v":"£m"},{"$f":"WINEP_Schemes!G63","v":1},{"$f":"WINEP_Schemes!H63","v":0},{"$f":"WINEP_Schemes!J63","v":1},{"$f":"WINEP_Schemes!I63","v":0.91},{"$f":"WINEP_Schemes!K63","v":1},{"$f":"WINEP_Schemes!L63","v":1},{"$f":"WINEP_Schemes!M63","v":"WR"},{"$f":"WINEP_Schemes!N63","v":1},0.91,0.91,0,0,0,0,0,0]
[null,null,{"$f":"WINEP_Schemes!C64","v":"LNA00100"},{"$f":"WINEP_Schemes!D64","v":"7AW101757"},{"$f":"WINEP_Schemes!E64","v":"BOURNE"},{"$f":"WINEP_Schemes!F64","v":0},{"$f":"WINEP_Schemes!G64","v":0},{"$f":"WINEP_Schemes!H64","v":0},{"$f":"WINEP_Schemes!J64","v":0},{"$f":"WINEP_Schemes!I64","v":0},{"$f":"WINEP_Schemes!K64","v":0},{"$f":"WINEP_Schemes!L64","v":0},{"$f":"WINEP_Schemes!M64","v":0},{"$f":"WINEP_Schemes!N64","v":0},0,0,0,0,0,0,0,0]
[null,null,{"$f":"WINEP_Schemes!C65","v":"LNA00018"},{"$f":"WINEP_Schemes!D65","v":"7AW101761"},{"$f":"WINEP_Schemes!E65","v":"WANEHAM BRIDGE"},{"$f":"WINEP_Schemes!F65","v":0},{"$f":"WINEP_Schemes!G65","v":0},{"$f":"WINEP_Schemes!H65","v":0},{"$f":"WINEP_Schemes!J65","v":0},{"$f":"WINEP_Schemes!I65","v":0},{"$f":"WINEP_Schemes!K65","v":0},{"$f":"WINEP_Schemes!L65","v":0},{"$f":"WINEP_Schemes!M65","v":0},{"$f":"WINEP_Schemes!N65","v":0},0,0,0,0,0,0,0,0]
[null,null,{"$f":"WINEP_Schemes!C66","v":"LNA00019"},{"$f":"WINEP_Schemes!D66","v":"7AW101761"},{"$f":"WINEP_Schemes!E66","v":"MOOR FARM"},{"$f":"WINEP_Schemes!F66","v":0},{"$f":"WINEP_Schemes!G66","v":0},{"$f":"WINEP_Schemes!H66","v":0},{"$f":"WINEP_Schemes!J66","v":0},{"$f":"WINEP_Schemes!I66","v":0},{"$f":"WINEP_Schemes!K66","v":0},{"$f":"WINEP_Schemes!L66","v":0},{"$f":"WINEP_Schemes!M66","v":0},{"$f":"WINEP_Schemes!N66","v":0},0,0,0,0,0,0,0,0]
[null,null,{"$f":"WINEP_Schemes!C67","v":"LNA00106"},{"$f":"WINEP_Schemes!D67","v":"7AW101761"},{"$f":"WINEP_Schemes!E67","v":"Branston Booths"},{"$f":"WINEP_Schemes!F67","v":0},{"$f":"WINEP_Schemes!G67","v":0},{"$f":"WINEP_Schemes!H67","v":0},{"$f":"WINEP_Schemes!J67","v":0},{"$f":"WINEP_Schemes!I67","v":0},{"$f":"WINEP_Schemes!K67","v":0},{"$f":"WINEP_Schemes!L67","v":0},{"$f":"WINEP_Schemes!M67","v":0},{"$f":"WINEP_Schemes!N67","v":0},0,0,0,0,0,0,0,0]
[null,null,{"$f":"WINEP_Schemes!C68","v":"LNA00041"},{"$f":"WINEP_Schemes!D68","v":"7AW101783"},{"$f":"WINEP_Schemes!E68","v":"RUTLAND WATER/GWASH FLOWS"},{"$f":"WINEP_Schemes!F68","v":"£m"},{"$f":"WINEP_Schemes!G68","v":1},{"$f":"WINEP_Schemes!H68","v":0},{"$f":"WINEP_Schemes!J68","v":1},{"$f":"WINEP_Schemes!I68","v":0.46300000000000002},{"$f":"WINEP_Schemes!K68","v":1},{"$f":"WINEP_Schemes!L68","v":1},{"$f":"WINEP_Schemes!M68","v":"WR"},{"$f":"WINEP_Schemes!N68","v":1},0.46300000000000002,0.46300000000000002,0,0,0,0,0,0]
[null,null,{"$f":"WINEP_Schemes!C69","v":"EAN00470"},{"$f":"WINEP_Schemes!D69","v":"7AW200053"},{"$f":"WINEP_Schemes!E69","v":"Ashbrook STW"},{"$f":"WINEP_Schemes!F69","v":"£m"},{"$f":"WINEP_Schemes!G69","v":1},{"$f":"WINEP_Schemes!H69","v":0},{"$f":"WINEP_Schemes!J69","v":1},{"$f":"WINEP_Schemes!I69","v":1.98},{"$f":"WINEP_Schemes!K69","v":1},{"$f":"WINEP_Schemes!L69","v":1},{"$f":"WINEP_Schemes!M69","v":"WWN"},{"$f":"WINEP_Schemes!N69","v":1},1.98,1.98,0,0,0,0,0,0]
[null,null,{"$f":"WINEP_Schemes!C70","v":"EAN00471"},{"$f":"WINEP_Schemes!D70","v":"7AW200054"},{"$f":"WINEP_Schemes!E70","v":"Ashton STW"},{"$f":"WINEP_Schemes!F70","v":"£m"},{"$f":"WINEP_Schemes!G70","v":1},{"$f":"WINEP_Schemes!H70","v":0},{"$f":"WINEP_Schemes!J70","v":1},{"$f":"WINEP_Schemes!I70","v":3.7050000000000001},{"$f":"WINEP_Schemes!K70","v":1},{"$f":"WINEP_Schemes!L70","v":1},{"$f":"WINEP_Schemes!M70","v":"WWN"},{"$f":"WINEP_Schemes!N70","v":1},3.7050000000000001,3.7050000000000001,0,0,0,0,0,0]
[null,null,{"$f":"WINEP_Schemes!C71","v":"EAN00474"},{"$f":"WINEP_Schemes!D71","v":"7AW200057"},{"$f":"WINEP_Schemes!E71","v":"Bassingbourn STW"},{"$f":"WINEP_Schemes!F71","v":"£m"},{"$f":"WINEP_Schemes!G71","v":1},{"$f":"WINEP_Schemes!H71","v":0},{"$f":"WINEP_Schemes!J71","v":1},{"$f":"WINEP_Schemes!I71","v":1.895},{"$f":"WINEP_Schemes!K71","v":1},{"$f":"WINEP_Schemes!L71","v":1},{"$f":"WINEP_Schemes!M71","v":"WWN"},{"$f":"WINEP_Schemes!N71","v":1},1.895,1.895,0,0,0,0,0,0]
[null,null,{"$f":"WINEP_Schemes!C72","v":"EAN00475"},{"$f":"WINEP_Schemes!D72","v":"7AW200058"},{"$f":"WINEP_Schemes!E72","v":"Beachampton STW"},{"$f":"WINEP_Schemes!F72","v":"£m"},{"$f":"WINEP_Schemes!G72","v":1},{"$f":"WINEP_Schemes!H72","v":0},{"$f":"WINEP_Schemes!J72","v":1},{"$f":"WINEP_Schemes!I72","v":1.133},{"$f":"WINEP_Schemes!K72","v":1},{"$f":"WINEP_Schemes!L72","v":1},{"$f":"WINEP_Schemes!M72","v":"WWN"},{"$f":"WINEP_Schemes!N72","v":1},1.133,1.133,0,0,0,0,0,0]
[null,null,{"$f":"WINEP_Schemes!C73","v":"EAN00478"},{"$f":"WINEP_Schemes!D73","v":"7AW200061"},{"$f":"WINEP_Schemes!E73","v":"Blakesley STW"},{"$f":"WINEP_Schemes!F73","v":"£m"},{"$f":"WINEP_Schemes!G73","v":1},{"$f":"WINEP_Schemes!H73","v":0},{"$f":"WINEP_Schemes!J73","v":1},{"$f":"WINEP_Schemes!I73","v":0.09},{"$f":"WINEP_Schemes!K73","v":1},{"$f":"WINEP_Schemes!L73","v":1},{"$f":"WINEP_Schemes!M73","v":"WWN"},{"$f":"WINEP_Schemes!N73","v":1},0.09,0.09,0,0,0,0,0,0]
[null,null,{"$f":"WINEP_Schemes!C74","v":"EAN00479"},{"$f":"WINEP_Schemes!D74","v":"7AW200062"},{"$f":"WINEP_Schemes!E74","v":"Bottisham STW"},{"$f":"WINEP_Schemes!F74","v":"£m"},{"$f":"WINEP_Schemes!G74","v":1},{"$f":"WINEP_Schemes!H74","v":0},{"$f":"WINEP_Schemes!J74","v":1},{"$f":"WINEP_Schemes!I74","v":0.66100000000000003},{"$f":"WINEP_Schemes!K74","v":1},{"$f":"WINEP_Schemes!L74","v":1},{"$f":"WINEP_Schemes!M74","v":"WWN"},{"$f":"WINEP_Schemes!N74","v":1},0.66100000000000003,0.66100000000000003,0,0,0,0,0,0]
[null,null,{"$f":"WINEP_Schemes!C75","v":"EAN00480"},{"$f":"WINEP_Schemes!D75","v":"7AW200063"},{"$f":"WINEP_Schemes!E75","v":"Bourn STW"},{"$f":"WINEP_Schemes!F75","v":"£m"},{"$f":"WINEP_Schemes!G75","v":1},{"$f":"WINEP_Schemes!H75","v":0},{"$f":"WINEP_Schemes!J75","v":1},{"$f":"WINEP_Schemes!I75","v":0.64200000000000002},{"$f":"WINEP_Schemes!K75","v":1},{"$f":"WINEP_Schemes!L75","v":1},{"$f":"WINEP_Schemes!M75","v":"WWN"},{"$f":"WINEP_Schemes!N75","v":1},0.64200000000000002,0.64200000000000002,0,0,0,0,0,0]
[null,null,{"$f":"WINEP_Schemes!C76","v":"EAN00481"},{"$f":"WINEP_Schemes!D76","v":"7AW200064"},{"$f":"WINEP_Schemes!E76","v":"Bradenham STW"},{"$f":"WINEP_Schemes!F76","v":"£m"},{"$f":"WINEP_Schemes!G76","v":1},{"$f":"WINEP_Schemes!H76","v":0},{"$f":"WINEP_Schemes!J76","v":1},{"$f":"WINEP_Schemes!I76","v":0.222},{"$f":"WINEP_Schemes!K76","v":1},{"$f":"WINEP_Schemes!L76","v":1},{"$f":"WINEP_Schemes!M76","v":"WWN"},{"$f":"WINEP_Schemes!N76","v":1},0.222,0.222,0,0,0,0,0,0]
[null,null,{"$f":"WINEP_Schemes!C77","v":"EAN00483"},{"$f":"WINEP_Schemes!D77","v":"7AW200066"},{"$f":"WINEP_Schemes!E77","v":"Burwell STW"},{"$f":"WINEP_Schemes!F77","v":"£m"},{"$f":"WINEP_Schemes!G77","v":1},{"$f":"WINEP_Schemes!H77","v":0},{"$f":"WINEP_Schemes!J77","v":1},{"$f":"WINEP_Schemes!I77","v":1.7929999999999999},{"$f":"WINEP_Schemes!K77","v":1},{"$f":"WINEP_Schemes!L77","v":1},{"$f":"WINEP_Schemes!M77","v":"WWN"},{"$f":"WINEP_Schemes!N77","v":1},1.7929999999999999,1.7929999999999999,0,0,0,0,0,0]
[null,null,{"$f":"WINEP_Schemes!C78","v":"EAN00484"},{"$f":"WINEP_Schemes!D78","v":"7AW200067"},{"$f":"WINEP_Schemes!E78","v":"Carbrooke Church Rd STW (FTRS Scheme)"},{"$f":"WINEP_Schemes!F78","v":"£m"},{"$f":"WINEP_Schemes!G78","v":1},{"$f":"WINEP_Schemes!H78","v":0},{"$f":"WINEP_Schemes!J78","v":1},{"$f":"WINEP_Schemes!I78","v":1.252},{"$f":"WINEP_Schemes!K78","v":1},{"$f":"WINEP_Schemes!L78","v":1},{"$f":"WINEP_Schemes!M78","v":"WWN"},{"$f":"WINEP_Schemes!N78","v":1},1.252,1.252,0,{"$f":" IF($M79 = R$9, $Q79, 0)","v":0},0,0,0,0]
[null,null,{"$f":"WINEP_Schemes!C79","v":"EAN00485"},{"$f":"WINEP_Schemes!D79","v":"7AW200068"},{"$f":"WINEP_Schemes!E79","v":"Castlethorpe STW"},{"$f":"WINEP_Schemes!F79","v":"£m"},{"$f":"WINEP_Schemes!G79","v":1},{"$f":"WINEP_Schemes!H79","v":0},{"$f":"WINEP_Schemes!J79","v":1},{"$f":"WINEP_Schemes!I79","v":0.09},{"$f":"WINEP_Schemes!K79","v":1},{"$f":"WINEP_Schemes!L79","v":1},{"$f":"WINEP_Schemes!M79","v":"WWN"},{"$f":"WINEP_Schemes!N79","v":1},0.09,0.09,0,0,0,0,0,0]
[null,null,{"$f":"WINEP_Schemes!C80","v":"EAN00486"},{"$f":"WINEP_Schemes!D80","v":"7AW200069"},{"$f":"WINEP_Schemes!E80","v":"Chippenham STW"},{"$f":"WINEP_Schemes!F80","v":"£m"},{"$f":"WINEP_Schemes!G80","v":1},{"$f":"WINEP_Schemes!H80","v":0},{"$f":"WINEP_Schemes!J80","v":1},{"$f":"WINEP_Schemes!I80","v":0.157},{"$f":"WINEP_Schemes!K80","v":1},{"$f":"WINEP_Schemes!L80","v":1},{"$f":"WINEP_Schemes!M80","v":"WWN"},{"$f":"WINEP_Schemes!N80","v":1},{"$f":" I81 * J81 * G81","v":0.157},{"$f":" N81 * O81","v":0.157},{"$f":" IF(L81 = 0, P81, (N81 - 1) * O81)","v":0},0,0,0,0,0]
[null,null,{"$f":"WINEP_Schemes!C81","v":"EAN00488"},{"$f":"WINEP_Schemes!D81","v":"7AW200071"},{"$f":"WINEP_Schemes!E81","v":"Coney Weston STW"},{"$f":"WINEP_Schemes!F81","v":0},{"$f":"WINEP_Schemes!G81","v":0},{"$f":"WINEP_Schemes!H81","v":0},{"$f":"WINEP_Schemes!J81","v":0},{"$f":"WINEP_Schemes!I81","v":0},{"$f":"WINEP_Schemes!K81","v":0},{"$f":"WINEP_Schemes!L81","v":0},{"$f":"WINEP_Schemes!M81","v":0},{"$f":"WINEP_Schemes!N81","v":0},0,0,0,0,0,0,0,0]
[null,null,{"$f":"WINEP_Schemes!C82","v":"EAN00489"},{"$f":"WINEP_Schemes!D82","v":"7AW200072"},{"$f":"WINEP_Schemes!E82","v":"Coton STW"},{"$f":"WINEP_Schemes!F82","v":"£m"},{"$f":"WINEP_Schemes!G82","v":1},{"$f":"WINEP_Schemes!H82","v":0},{"$f":"WINEP_Schemes!J82","v":1},{"$f":"WINEP_Schemes!I82","v":1.18},{"$f":"WINEP_Schemes!K82","v":1},{"$f":"WINEP_Schemes!L82","v":1},{"$f":"WINEP_Schemes!M82","v":"WWN"},{"$f":"WINEP_Schemes!N82","v":1},1.18,1.18,0,0,0,0,0,0]
[null,null,{"$f":"WINEP_Schemes!C83","v":"EAN00490"},{"$f":"WINEP_Schemes!D83","v":"7AW200073"},{"$f":"WINEP_Schemes!E83","v":"Cublington (Wing) STW"},{"$f":"WINEP_Schemes!F83","v":"£m"},{"$f":"WINEP_Schemes!G83","v":1},{"$f":"WINEP_Schemes!H83","v":0},{"$f":"WINEP_Schemes!J83","v":1},{"$f":"WINEP_Schemes!I83","v":2.5190000000000001},{"$f":"WINEP_Schemes!K83","v":1},{"$f":"WINEP_Schemes!L83","v":1},{"$f":"WINEP_Schemes!M83","v":"WWN"},{"$f":"WINEP_Schemes!N83","v":1},2.5190000000000001,2.5190000000000001,0,0,0,0,0,0]
[null,null,{"$f":"WINEP_Schemes!C84","v":"EAN00491"},{"$f":"WINEP_Schemes!D84","v":"7AW200074"},{"$f":"WINEP_Schemes!E84","v":"Doddington STW"},{"$f":"WINEP_Schemes!F84","v":"£m"},{"$f":"WINEP_Schemes!G84","v":1},{"$f":"WINEP_Schemes!H84","v":0},{"$f":"WINEP_Schemes!J84","v":1},{"$f":"WINEP_Schemes!I84","v":0.59499999999999997},{"$f":"WINEP_Schemes!K84","v":1},{"$f":"WINEP_Schemes!L84","v":1},{"$f":"WINEP_Schemes!M84","v":"WWN"},{"$f":"WINEP_Schemes!N84","v":1},0.59499999999999997,0.59499999999999997,0,0,0,0,0,0]
[null,null,{"$f":"WINEP_Schemes!C85","v":"EAN00494"},{"$f":"WINEP_Schemes!D85","v":"7AW200077"},{"$f":"WINEP_Schemes!E85","v":"Elmdon STW"},{"$f":"WINEP_Schemes!F85","v":"£m"},{"$f":"WINEP_Schemes!G85","v":1},{"$f":"WINEP_Schemes!H85","v":0},{"$f":"WINEP_Schemes!J85","v":1},{"$f":"WINEP_Schemes!I85","v":0.22500000000000001},{"$f":"WINEP_Schemes!K85","v":1},{"$f":"WINEP_Schemes!L85","v":1},{"$f":"WINEP_Schemes!M85","v":"WWN"},{"$f":"WINEP_Schemes!N85","v":1},0.22500000000000001,0.22500000000000001,0,0,0,0,0,0]
[null,null,{"$f":"WINEP_Schemes!C86","v":"EAN00495"},{"$f":"WINEP_Schemes!D86","v":"7AW200078"},{"$f":"WINEP_Schemes!E86","v":"Everton STW"},{"$f":"WINEP_Schemes!F86","v":"£m"},{"$f":"WINEP_Schemes!G86","v":1},{"$f":"WINEP_Schemes!H86","v":0},{"$f":"WINEP_Schemes!J86","v":1},{"$f":"WINEP_Schemes!I86","v":1.585},{"$f":"WINEP_Schemes!K86","v":1},{"$f":"WINEP_Schemes!L86","v":1},{"$f":"WINEP_Schemes!M86","v":"WWN"},{"$f":"WINEP_Schemes!N86","v":1},1.585,1.585,0,0,0,0,0,0]
[null,null,{"$f":"WINEP_Schemes!C87","v":"EAN00498"},{"$f":"WINEP_Schemes!D87","v":"7AW200081"},{"$f":"WINEP_Schemes!E87","v":"Gazeley STW"},{"$f":"WINEP_Schemes!F87","v":"£m"},{"$f":"WINEP_Schemes!G87","v":1},{"$f":"WINEP_Schemes!H87","v":0},{"$f":"WINEP_Schemes!J87","v":1},{"$f":"WINEP_Schemes!I87","v":0.56299999999999994},{"$f":"WINEP_Schemes!K87","v":1},{"$f":"WINEP_Schemes!L87","v":1},{"$f":"WINEP_Schemes!M87","v":"WWN"},{"$f":"WINEP_Schemes!N87","v":1},0.56299999999999994,0.56299999999999994,0,0,0,0,0,0]
[null,null,{"$f":"WINEP_Schemes!C88","v":"EAN00500"},{"$f":"WINEP_Schemes!D88","v":"7AW200083"},{"$f":"WINEP_Schemes!E88","v":"Great Horwood STW"},{"$f":"WINEP_Schemes!F88","v":"£m"},{"$f":"WINEP_Schemes!G88","v":1},{"$f":"WINEP_Schemes!H88","v":0},{"$f":"WINEP_Schemes!J88","v":1},{"$f":"WINEP_Schemes!I88","v":1.879},{"$f":"WINEP_Schemes!K88","v":1},{"$f":"WINEP_Schemes!L88","v":1},{"$f":"WINEP_Schemes!M88","v":"WWN"},{"$f":"WINEP_Schemes!N88","v":1},1.879,1.879,0,0,0,0,0,0]
[null,null,{"$f":"WINEP_Schemes!C89","v":"EAN00501"},{"$f":"WINEP_Schemes!D89","v":"7AW200084"},{"$f":"WINEP_Schemes!E89","v":"Greens Norton STW"},{"$f":"WINEP_Schemes!F89","v":"£m"},{"$f":"WINEP_Schemes!G89","v":1},{"$f":"WINEP_Schemes!H89","v":0},{"$f":"WINEP_Schemes!J89","v":1},{"$f":"WINEP_Schemes!I89","v":0.55800000000000005},{"$f":"WINEP_Schemes!K89","v":1},{"$f":"WINEP_Schemes!L89","v":1},{"$f":"WINEP_Schemes!M89","v":"WWN"},{"$f":"WINEP_Schemes!N89","v":1},0.55800000000000005,0.55800000000000005,0,0,0,0,0,0]
[null,null,{"$f":"WINEP_Schemes!C90","v":"EAN00503"},{"$f":"WINEP_Schemes!D90","v":"7AW200086"},{"$f":"WINEP_Schemes!E90","v":"Hanslope STW"},{"$f":"WINEP_Schemes!F90","v":0},{"$f":"WINEP_Schemes!G90","v":0},{"$f":"WINEP_Schemes!H90","v":0},{"$f":"WINEP_Schemes!J90","v":0},{"$f":"WINEP_Schemes!I90","v":0},{"$f":"WINEP_Schemes!K90","v":0},{"$f":"WINEP_Schemes!L90","v":0},{"$f":"WINEP_Schemes!M90","v":0},{"$f":"WINEP_Schemes!N90","v":0},0,0,0,0,0,0,0,0]
[null,null,{"$f":"WINEP_Schemes!C91","v":"EAN00505"},{"$f":"WINEP_Schemes!D91","v":"7AW200088"},{"$f":"WINEP_Schemes!E91","v":"Hawstead STW"},{"$f":"WINEP_Schemes!F91","v":"£m"},{"$f":"WINEP_Schemes!G91","v":1},{"$f":"WINEP_Schemes!H91","v":0},{"$f":"WINEP_Schemes!J91","v":1},{"$f":"WINEP_Schemes!I91","v":2.8460000000000001},{"$f":"WINEP_Schemes!K91","v":1},{"$f":"WINEP_Schemes!L91","v":1},{"$f":"WINEP_Schemes!M91","v":"WWN"},{"$f":"WINEP_Schemes!N91","v":1},2.8460000000000001,2.8460000000000001,0,0,0,0,0,0]
[null,null,{"$f":"WINEP_Schemes!C92","v":"EAN00507"},{"$f":"WINEP_Schemes!D92","v":"7AW200090"},{"$f":"WINEP_Schemes!E92","v":"Ivinghoe STW"},{"$f":"WINEP_Schemes!F92","v":0},{"$f":"WINEP_Schemes!G92","v":0},{"$f":"WINEP_Schemes!H92","v":0},{"$f":"WINEP_Schemes!J92","v":0},{"$f":"WINEP_Schemes!I92","v":0},{"$f":"WINEP_Schemes!K92","v":0},{"$f":"WINEP_Schemes!L92","v":0},{"$f":"WINEP_Schemes!M92","v":0},{"$f":"WINEP_Schemes!N92","v":0},0,0,0,0,0,0,0,0]
[null,null,{"$f":"WINEP_Schemes!C93","v":"EAN00508"},{"$f":"WINEP_Schemes!D93","v":"7AW200091"},{"$f":"WINEP_Schemes!E93","v":"Lidgate STW"},{"$f":"WINEP_Schemes!F93","v":"£m"},{"$f":"WINEP_Schemes!G93","v":1},{"$f":"WINEP_Schemes!H93","v":0},{"$f":"WINEP_Schemes!J93","v":1},{"$f":"WINEP_Schemes!I93","v":1.5820000000000001},{"$f":"WINEP_Schemes!K93","v":1},{"$f":"WINEP_Schemes!L93","v":1},{"$f":"WINEP_Schemes!M93","v":"WWN"},{"$f":"WINEP_Schemes!N93","v":1},1.5820000000000001,1.5820000000000001,0,0,0,0,0,0]
[null,null,{"$f":"WINEP_Schemes!C94","v":"EAN00509"},{"$f":"WINEP_Schemes!D94","v":"7AW200092"},{"$f":"WINEP_Schemes!E94","v":"Linton STW"},{"$f":"WINEP_Schemes!F94","v":"£m"},{"$f":"WINEP_Schemes!G94","v":1},{"$f":"WINEP_Schemes!H94","v":0},{"$f":"WINEP_Schemes!J94","v":1},{"$f":"WINEP_Schemes!I94","v":0.79600000000000004},{"$f":"WINEP_Schemes!K94","v":1},{"$f":"WINEP_Schemes!L94","v":1},{"$f":"WINEP_Schemes!M94","v":"WWN"},{"$f":"WINEP_Schemes!N94","v":1},0.79600000000000004,0.79600000000000004,0,0,0,0,0,0]
[null,null,{"$f":"WINEP_Schemes!C95","v":"EAN00510"},{"$f":"WINEP_Schemes!D95","v":"7AW200093"},{"$f":"WINEP_Schemes!E95","v":"Litlington STW"},{"$f":"WINEP_Schemes!F95","v":"£m"},{"$f":"WINEP_Schemes!G95","v":1},{"$f":"WINEP_Schemes!H95","v":0},{"$f":"WINEP_Schemes!J95","v":1},{"$f":"WINEP_Schemes!I95","v":1.96},{"$f":"WINEP_Schemes!K95","v":1},{"$f":"WINEP_Schemes!L95","v":1},{"$f":"WINEP_Schemes!M95","v":"WWN"},{"$f":"WINEP_Schemes!N95","v":1},1.96,1.96,0,0,0,0,0,0]
[null,null,{"$f":"WINEP_Schemes!C96","v":"EAN00512"},{"$f":"WINEP_Schemes!D96","v":"7AW200095"},{"$f":"WINEP_Schemes!E96","v":"Newport STW"},{"$f":"WINEP_Schemes!F96","v":"£m"},{"$f":"WINEP_Schemes!G96","v":1},{"$f":"WINEP_Schemes!H96","v":0},{"$f":"WINEP_Schemes!J96","v":1},{"$f":"WINEP_Schemes!I96","v":0.09},{"$f":"WINEP_Schemes!K96","v":1},{"$f":"WINEP_Schemes!L96","v":1},{"$f":"WINEP_Schemes!M96","v":"WWN"},{"$f":"WINEP_Schemes!N96","v":1},0.09,0.09,0,0,0,0,0,0]
[null,null,{"$f":"WINEP_Schemes!C97","v":"EAN00514"},{"$f":"WINEP_Schemes!D97","v":"7AW200097"},{"$f":"WINEP_Schemes!E97","v":"Norton (Suffolk) STW"},{"$f":"WINEP_Schemes!F97","v":"£m"},{"$f":"WINEP_Schemes!G97","v":1},{"$f":"WINEP_Schemes!H97","v":0},{"$f":"WINEP_Schemes!J97","v":1},{"$f":"WINEP_Schemes!I97","v":0.22800000000000001},{"$f":"WINEP_Schemes!K97","v":1},{"$f":"WINEP_Schemes!L97","v":1},{"$f":"WINEP_Schemes!M97","v":"WWN"},{"$f":"WINEP_Schemes!N97","v":1},0.22800000000000001,0.22800000000000001,0,0,0,0,0,0]
[null,null,{"$f":"WINEP_Schemes!C98","v":"EAN00515"},{"$f":"WINEP_Schemes!D98","v":"7AW200098"},{"$f":"WINEP_Schemes!E98","v":"Odell STW"},{"$f":"WINEP_Schemes!F98","v":"£m"},{"$f":"WINEP_Schemes!G98","v":1},{"$f":"WINEP_Schemes!H98","v":0},{"$f":"WINEP_Schemes!J98","v":1},{"$f":"WINEP_Schemes!I98","v":1.867},{"$f":"WINEP_Schemes!K98","v":1},{"$f":"WINEP_Schemes!L98","v":1},{"$f":"WINEP_Schemes!M98","v":"WWN"},{"$f":"WINEP_Schemes!N98","v":1},1.867,1.867,0,0,0,0,0,0]
[null,null,{"$f":"WINEP_Schemes!C99","v":"EAN00516"},{"$f":"WINEP_Schemes!D99","v":"7AW200099"},{"$f":"WINEP_Schemes!E99","v":"Oldhurst STW"},{"$f":"WINEP_Schemes!F99","v":"£m"},{"$f":"WINEP_Schemes!G99","v":1},{"$f":"WINEP_Schemes!H99","v":0},{"$f":"WINEP_Schemes!J99","v":1},{"$f":"WINEP_Schemes!I99","v":1.821},{"$f":"WINEP_Schemes!K99","v":1},{"$f":"WINEP_Schemes!L99","v":1},{"$f":"WINEP_Schemes!M99","v":"WWN"},{"$f":"WINEP_Schemes!N99","v":1},1.821,1.821,0,0,0,0,0,0]
[null,null,{"$f":"WINEP_Schemes!C100","v":"EAN00517"},{"$f":"WINEP_Schemes!D100","v":"7AW200100"},{"$f":"WINEP_Schemes!E100","v":"Olney STW"},{"$f":"WINEP_Schemes!F100","v":"£m"},{"$f":"WINEP_Schemes!G100","v":1},{"$f":"WINEP_Schemes!H100","v":0},{"$f":"WINEP_Schemes!J100","v":1},{"$f":"WINEP_Schemes!I100","v":0.09},{"$f":"WINEP_Schemes!K100","v":1},{"$f":"WINEP_Schemes!L100","v":1},{"$f":"WINEP_Schemes!M100","v":"WWN"},{"$f":"WINEP_Schemes!N100","v":1},0.09,0.09,0,0,0,0,0,0]
[null,null,{"$f":"WINEP_Schemes!C101","v":"EAN00520"},{"$f":"WINEP_Schemes!D101","v":"7AW200103"},{"$f":"WINEP_Schemes!E101","v":"Papworth Everard STW"},{"$f":"WINEP_Schemes!F101","v":"£m"},{"$f":"WINEP_Schemes!G101","v":1},{"$f":"WINEP_Schemes!H101","v":0},{"$f":"WINEP_Schemes!J101","v":1},{"$f":"WINEP_Schemes!I101","v":4.7E-2},{"$f":"WINEP_Schemes!K101","v":1},{"$f":"WINEP_Schemes!L101","v":1},{"$f":"WINEP_Schemes!M101","v":"WWN"},{"$f":"WINEP_Schemes!N101","v":1},4.7E-2,4.7E-2,0,0,0,0,0,0]
[null,null,{"$f":"WINEP_Schemes!C102","v":"EAN00522"},{"$f":"WINEP_Schemes!D102","v":"7AW200105"},{"$f":"WINEP_Schemes!E102","v":"Quendon STW"},{"$f":"WINEP_Schemes!F102","v":"£m"},{"$f":"WINEP_Schemes!G102","v":1},{"$f":"WINEP_Schemes!H102","v":0},{"$f":"WINEP_Schemes!J102","v":1},{"$f":"WINEP_Schemes!I102","v":0.157},{"$f":"WINEP_Schemes!K102","v":1},{"$f":"WINEP_Schemes!L102","v":1},{"$f":"WINEP_Schemes!M102","v":"WWN"},{"$f":"WINEP_Schemes!N102","v":1},0.157,0.157,0,0,0,0,0,0]
[null,null,{"$f":"WINEP_Schemes!C103","v":"EAN00526"},{"$f":"WINEP_Schemes!D103","v":"7AW200109"},{"$f":"WINEP_Schemes!E103","v":"Shudy Camps STW"},{"$f":"WINEP_Schemes!F103","v":"£m"},{"$f":"WINEP_Schemes!G103","v":1},{"$f":"WINEP_Schemes!H103","v":0},{"$f":"WINEP_Schemes!J103","v":1},{"$f":"WINEP_Schemes!I103","v":0.22500000000000001},{"$f":"WINEP_Schemes!K103","v":1},{"$f":"WINEP_Schemes!L103","v":1},{"$f":"WINEP_Schemes!M103","v":"WWN"},{"$f":"WINEP_Schemes!N103","v":1},0.22500000000000001,0.22500000000000001,0,0,0,0,0,0]
[null,null,{"$f":"WINEP_Schemes!C104","v":"EAN00527"},{"$f":"WINEP_Schemes!D104","v":"7AW200110"},{"$f":"WINEP_Schemes!E104","v":"Silverstone STW"},{"$f":"WINEP_Schemes!F104","v":"£m"},{"$f":"WINEP_Schemes!G104","v":1},{"$f":"WINEP_Schemes!H104","v":0},{"$f":"WINEP_Schemes!J104","v":1},{"$f":"WINEP_Schemes!I104","v":3.0259999999999998},{"$f":"WINEP_Schemes!K104","v":1},{"$f":"WINEP_Schemes!L104","v":1},{"$f":"WINEP_Schemes!M104","v":"WWN"},{"$f":"WINEP_Schemes!N104","v":1},3.0259999999999998,3.0259999999999998,0,0,0,0,0,0]
[null,null,{"$f":"WINEP_Schemes!C105","v":"EAN00529"},{"$f":"WINEP_Schemes!D105","v":"7AW200112"},{"$f":"WINEP_Schemes!E105","v":"Somersham (Cambs) STW"},{"$f":"WINEP_Schemes!F105","v":"£m"},{"$f":"WINEP_Schemes!G105","v":1},{"$f":"WINEP_Schemes!H105","v":0},{"$f":"WINEP_Schemes!J105","v":1},{"$f":"WINEP_Schemes!I105","v":1.7569999999999999},{"$f":"WINEP_Schemes!K105","v":1},{"$f":"WINEP_Schemes!L105","v":1},{"$f":"WINEP_Schemes!M105","v":"WWN"},{"$f":"WINEP_Schemes!N105","v":1},1.7569999999999999,1.7569999999999999,0,0,0,0,0,0]
[null,null,{"$f":"WINEP_Schemes!C106","v":"EAN00533"},{"$f":"WINEP_Schemes!D106","v":"7AW200116"},{"$f":"WINEP_Schemes!E106","v":"Stoke Goldington STW"},{"$f":"WINEP_Schemes!F106","v":"£m"},{"$f":"WINEP_Schemes!G106","v":1},{"$f":"WINEP_Schemes!H106","v":0},{"$f":"WINEP_Schemes!J106","v":1},{"$f":"WINEP_Schemes!I106","v":0.22500000000000001},{"$f":"WINEP_Schemes!K106","v":1},{"$f":"WINEP_Schemes!L106","v":1},{"$f":"WINEP_Schemes!M106","v":"WWN"},{"$f":"WINEP_Schemes!N106","v":1},0.22500000000000001,0.22500000000000001,0,0,0,0,0,0]
[null,null,{"$f":"WINEP_Schemes!C107","v":"EAN00535"},{"$f":"WINEP_Schemes!D107","v":"7AW200118"},{"$f":"WINEP_Schemes!E107","v":"Syresham STW"},{"$f":"WINEP_Schemes!F107","v":"£m"},{"$f":"WINEP_Schemes!G107","v":1},{"$f":"WINEP_Schemes!H107","v":0},{"$f":"WINEP_Schemes!J107","v":1},{"$f":"WINEP_Schemes!I107","v":1.718},{"$f":"WINEP_Schemes!K107","v":1},{"$f":"WINEP_Schemes!L107","v":1},{"$f":"WINEP_Schemes!M107","v":"WWN"},{"$f":"WINEP_Schemes!N107","v":1},1.718,1.718,0,0,0,0,0,0]
[null,null,{"$f":"WINEP_Schemes!C108","v":"EAN00536"},{"$f":"WINEP_Schemes!D108","v":"7AW200119"},{"$f":"WINEP_Schemes!E108","v":"Thurleigh STW"},{"$f":"WINEP_Schemes!F108","v":"£m"},{"$f":"WINEP_Schemes!G108","v":1},{"$f":"WINEP_Schemes!H108","v":0},{"$f":"WINEP_Schemes!J108","v":1},{"$f":"WINEP_Schemes!I108","v":1.915},{"$f":"WINEP_Schemes!K108","v":1},{"$f":"WINEP_Schemes!L108","v":1},{"$f":"WINEP_Schemes!M108","v":"WWN"},{"$f":"WINEP_Schemes!N108","v":1},1.915,1.915,0,0,0,0,0,0]
[null,null,{"$f":"WINEP_Schemes!C109","v":"EAN00537"},{"$f":"WINEP_Schemes!D109","v":"7AW200120"},{"$f":"WINEP_Schemes!E109","v":"Thurston STW"},{"$f":"WINEP_Schemes!F109","v":"£m"},{"$f":"WINEP_Schemes!G109","v":1},{"$f":"WINEP_Schemes!H109","v":0},{"$f":"WINEP_Schemes!J109","v":1},{"$f":"WINEP_Schemes!I109","v":4.4109999999999996},{"$f":"WINEP_Schemes!K109","v":1},{"$f":"WINEP_Schemes!L109","v":1},{"$f":"WINEP_Schemes!M109","v":"WWN"},{"$f":"WINEP_Schemes!N109","v":1},4.4109999999999996,4.4109999999999996,0,0,0,0,0,0]
[null,null,{"$f":"WINEP_Schemes!C110","v":"EAN00538"},{"$f":"WINEP_Schemes!D110","v":"7AW200121"},{"$f":"WINEP_Schemes!E110","v":"Tiffield STW"},{"$f":"WINEP_Schemes!F110","v":"£m"},{"$f":"WINEP_Schemes!G110","v":1},{"$f":"WINEP_Schemes!H110","v":0},{"$f":"WINEP_Schemes!J110","v":1},{"$f":"WINEP_Schemes!I110","v":2.278},{"$f":"WINEP_Schemes!K110","v":1},{"$f":"WINEP_Schemes!L110","v":1},{"$f":"WINEP_Schemes!M110","v":"WWN"},{"$f":"WINEP_Schemes!N110","v":1},2.278,2.278,0,0,0,0,0,0]
[null,null,{"$f":"WINEP_Schemes!C111","v":"EAN00539"},{"$f":"WINEP_Schemes!D111","v":"7AW200122"},{"$f":"WINEP_Schemes!E111","v":"Towcester STW"},{"$f":"WINEP_Schemes!F111","v":"£m"},{"$f":"WINEP_Schemes!G111","v":1},{"$f":"WINEP_Schemes!H111","v":0},{"$f":"WINEP_Schemes!J111","v":1},{"$f":"WINEP_Schemes!I111","v":4.282},{"$f":"WINEP_Schemes!K111","v":1},{"$f":"WINEP_Schemes!L111","v":1},{"$f":"WINEP_Schemes!M111","v":"WWN"},{"$f":"WINEP_Schemes!N111","v":1},4.282,4.282,0,0,0,0,0,0]
[null,null,{"$f":"WINEP_Schemes!C112","v":"EAN00540"},{"$f":"WINEP_Schemes!D112","v":"7AW200123"},{"$f":"WINEP_Schemes!E112","v":"Tuddenham (Bury St Edmunds) STW"},{"$f":"WINEP_Schemes!F112","v":"£m"},{"$f":"WINEP_Schemes!G112","v":1},{"$f":"WINEP_Schemes!H112","v":0},{"$f":"WINEP_Schemes!J112","v":1},{"$f":"WINEP_Schemes!I112","v":1.9219999999999999},{"$f":"WINEP_Schemes!K112","v":1},{"$f":"WINEP_Schemes!L112","v":1},{"$f":"WINEP_Schemes!M112","v":"WWN"},{"$f":"WINEP_Schemes!N112","v":1},1.9219999999999999,1.9219999999999999,0,0,0,0,0,0]
[null,null,{"$f":"WINEP_Schemes!C113","v":"EAN00542"},{"$f":"WINEP_Schemes!D113","v":"7AW200125"},{"$f":"WINEP_Schemes!E113","v":"Waresley STW"},{"$f":"WINEP_Schemes!F113","v":0},{"$f":"WINEP_Schemes!G113","v":0},{"$f":"WINEP_Schemes!H113","v":0},{"$f":"WINEP_Schemes!J113","v":0},{"$f":"WINEP_Schemes!I113","v":0},{"$f":"WINEP_Schemes!K113","v":0},{"$f":"WINEP_Schemes!L113","v":0},{"$f":"WINEP_Schemes!M113","v":0},{"$f":"WINEP_Schemes!N113","v":0},0,0,0,0,0,0,0,0]
[null,null,{"$f":"WINEP_Schemes!C114","v":"EAN00544"},{"$f":"WINEP_Schemes!D114","v":"7AW200127"},{"$f":"WINEP_Schemes!E114","v":"Whaddon STW"},{"$f":"WINEP_Schemes!F114","v":"£m"},{"$f":"WINEP_Schemes!G114","v":1},{"$f":"WINEP_Schemes!H114","v":0},{"$f":"WINEP_Schemes!J114","v":1},{"$f":"WINEP_Schemes!I114","v":3.5880000000000001},{"$f":"WINEP_Schemes!K114","v":1},{"$f":"WINEP_Schemes!L114","v":1},{"$f":"WINEP_Schemes!M114","v":"WWN"},{"$f":"WINEP_Schemes!N114","v":1},3.5880000000000001,3.5880000000000001,0,0,0,0,0,0]
[null,null,{"$f":"WINEP_Schemes!C115","v":"EAN00565"},{"$f":"WINEP_Schemes!D115","v":"7AW200143"},{"$f":"WINEP_Schemes!E115","v":"Benhall (Saxmundham) STW"},{"$f":"WINEP_Schemes!F115","v":"£m"},{"$f":"WINEP_Schemes!G115","v":1},{"$f":"WINEP_Schemes!H115","v":0},{"$f":"WINEP_Schemes!J115","v":1},{"$f":"WINEP_Schemes!I115","v":1.871},{"$f":"WINEP_Schemes!K115","v":1},{"$f":"WINEP_Schemes!L115","v":1},{"$f":"WINEP_Schemes!M115","v":"WWN"},{"$f":"WINEP_Schemes!N115","v":1},1.871,1.871,0,0,0,0,0,0]
[null,null,{"$f":"WINEP_Schemes!C116","v":"EAN00566"},{"$f":"WINEP_Schemes!D116","v":"7AW200144"},{"$f":"WINEP_Schemes!E116","v":"Framlingham STW"},{"$f":"WINEP_Schemes!F116","v":"£m"},{"$f":"WINEP_Schemes!G116","v":1},{"$f":"WINEP_Schemes!H116","v":0},{"$f":"WINEP_Schemes!J116","v":1},{"$f":"WINEP_Schemes!I116","v":2.2490000000000001},{"$f":"WINEP_Schemes!K116","v":1},{"$f":"WINEP_Schemes!L116","v":1},{"$f":"WINEP_Schemes!M116","v":"WWN"},{"$f":"WINEP_Schemes!N116","v":1},2.2490000000000001,2.2490000000000001,0,0,0,0,0,0]
[null,null,{"$f":"WINEP_Schemes!C117","v":"EAN00567"},{"$f":"WINEP_Schemes!D117","v":"7AW200145"},{"$f":"WINEP_Schemes!E117","v":"Halesworth STW"},{"$f":"WINEP_Schemes!F117","v":"£m"},{"$f":"WINEP_Schemes!G117","v":1},{"$f":"WINEP_Schemes!H117","v":0},{"$f":"WINEP_Schemes!J117","v":1},{"$f":"WINEP_Schemes!I117","v":0.71299999999999997},{"$f":"WINEP_Schemes!K117","v":1},{"$f":"WINEP_Schemes!L117","v":1},{"$f":"WINEP_Schemes!M117","v":"WWN"},{"$f":"WINEP_Schemes!N117","v":1},0.71299999999999997,0.71299999999999997,0,0,0,0,0,0]
[null,null,{"$f":"WINEP_Schemes!C118","v":"EAN00569"},{"$f":"WINEP_Schemes!D118","v":"7AW200147"},{"$f":"WINEP_Schemes!E118","v":"Wenhaston STW"},{"$f":"WINEP_Schemes!F118","v":"£m"},{"$f":"WINEP_Schemes!G118","v":1},{"$f":"WINEP_Schemes!H118","v":0},{"$f":"WINEP_Schemes!J118","v":1},{"$f":"WINEP_Schemes!I118","v":2.78},{"$f":"WINEP_Schemes!K118","v":1},{"$f":"WINEP_Schemes!L118","v":1},{"$f":"WINEP_Schemes!M118","v":"WWN"},{"$f":"WINEP_Schemes!N118","v":1},2.78,2.78,0,0,0,0,0,0]
[null,null,{"$f":"WINEP_Schemes!C119","v":"EAN00573"},{"$f":"WINEP_Schemes!D119","v":"7AW200151"},{"$f":"WINEP_Schemes!E119","v":"Rayleigh East STW (CIP2 T1)"},{"$f":"WINEP_Schemes!F119","v":"£m"},{"$f":"WINEP_Schemes!G119","v":1},{"$f":"WINEP_Schemes!H119","v":0},{"$f":"WINEP_Schemes!J119","v":1},{"$f":"WINEP_Schemes!I119","v":5.4450000000000003},{"$f":"WINEP_Schemes!K119","v":1},{"$f":"WINEP_Schemes!L119","v":1},{"$f":"WINEP_Schemes!M119","v":"WWN"},{"$f":"WINEP_Schemes!N119","v":1},5.4450000000000003,5.4450000000000003,0,0,0,0,0,0]
[null,null,{"$f":"WINEP_Schemes!C120","v":"EAN00586"},{"$f":"WINEP_Schemes!D120","v":"7AW200164"},{"$f":"WINEP_Schemes!E120","v":"Alconbury STW"},{"$f":"WINEP_Schemes!F120","v":"£m"},{"$f":"WINEP_Schemes!G120","v":1},{"$f":"WINEP_Schemes!H120","v":0},{"$f":"WINEP_Schemes!J120","v":1},{"$f":"WINEP_Schemes!I120","v":2.9390000000000001},{"$f":"WINEP_Schemes!K120","v":1},{"$f":"WINEP_Schemes!L120","v":1},{"$f":"WINEP_Schemes!M120","v":"WWN"},{"$f":"WINEP_Schemes!N120","v":1},2.9390000000000001,2.9390000000000001,0,0,0,0,0,0]
[null,null,{"$f":"WINEP_Schemes!C121","v":"EAN00588"},{"$f":"WINEP_Schemes!D121","v":"7AW200166"},{"$f":"WINEP_Schemes!E121","v":"Bolnhurst STW"},{"$f":"WINEP_Schemes!F121","v":"£m"},{"$f":"WINEP_Schemes!G121","v":1},{"$f":"WINEP_Schemes!H121","v":0},{"$f":"WINEP_Schemes!J121","v":1},{"$f":"WINEP_Schemes!I121","v":2.3929999999999998},{"$f":"WINEP_Schemes!K121","v":1},{"$f":"WINEP_Schemes!L121","v":1},{"$f":"WINEP_Schemes!M121","v":"WWN"},{"$f":"WINEP_Schemes!N121","v":1},2.3929999999999998,2.3929999999999998,0,0,0,0,0,0]
[null,null,{"$f":"WINEP_Schemes!C122","v":"EAN00589"},{"$f":"WINEP_Schemes!D122","v":"7AW200167"},{"$f":"WINEP_Schemes!E122","v":"Dunton STW"},{"$f":"WINEP_Schemes!F122","v":"£m"},{"$f":"WINEP_Schemes!G122","v":1},{"$f":"WINEP_Schemes!H122","v":0},{"$f":"WINEP_Schemes!J122","v":1},{"$f":"WINEP_Schemes!I122","v":0.222},{"$f":"WINEP_Schemes!K122","v":1},{"$f":"WINEP_Schemes!L122","v":1},{"$f":"WINEP_Schemes!M122","v":"WWN"},{"$f":"WINEP_Schemes!N122","v":1},0.222,0.222,0,0,0,0,0,0]
[null,null,{"$f":"WINEP_Schemes!C123","v":"EAN00590"},{"$f":"WINEP_Schemes!D123","v":"7AW200168"},{"$f":"WINEP_Schemes!E123","v":"East Harling STW"},{"$f":"WINEP_Schemes!F123","v":0},{"$f":"WINEP_Schemes!G123","v":0},{"$f":"WINEP_Schemes!H123","v":0},{"$f":"WINEP_Schemes!J123","v":0},{"$f":"WINEP_Schemes!I123","v":0},{"$f":"WINEP_Schemes!K123","v":0},{"$f":"WINEP_Schemes!L123","v":0},{"$f":"WINEP_Schemes!M123","v":0},{"$f":"WINEP_Schemes!N123","v":0},0,0,0,0,0,0,0,0]
[null,null,{"$f":"WINEP_Schemes!C124","v":"EAN00591"},{"$f":"WINEP_Schemes!D124","v":"7AW200169"},{"$f":"WINEP_Schemes!E124","v":"Ely (New) STW"},{"$f":"WINEP_Schemes!F124","v":"£m"},{"$f":"WINEP_Schemes!G124","v":1},{"$f":"WINEP_Schemes!H124","v":0},{"$f":"WINEP_Schemes!J124","v":1},{"$f":"WINEP_Schemes!I124","v":1.1040000000000001},{"$f":"WINEP_Schemes!K124","v":1},{"$f":"WINEP_Schemes!L124","v":1},{"$f":"WINEP_Schemes!M124","v":"WWN"},{"$f":"WINEP_Schemes!N124","v":1},1.1040000000000001,1.1040000000000001,0,0,0,0,0,0]
[null,null,{"$f":"WINEP_Schemes!C125","v":"EAN00592"},{"$f":"WINEP_Schemes!D125","v":"7AW200170"},{"$f":"WINEP_Schemes!E125","v":"Ely STW"},{"$f":"WINEP_Schemes!F125","v":"£m"},{"$f":"WINEP_Schemes!G125","v":1},{"$f":"WINEP_Schemes!H125","v":0},{"$f":"WINEP_Schemes!J125","v":1},{"$f":"WINEP_Schemes!I125","v":1.998},{"$f":"WINEP_Schemes!K125","v":1},{"$f":"WINEP_Schemes!L125","v":1},{"$f":"WINEP_Schemes!M125","v":"WWN"},{"$f":"WINEP_Schemes!N125","v":1},1.998,1.998,0,0,0,0,0,0]
[null,null,{"$f":"WINEP_Schemes!C126","v":"EAN00594"},{"$f":"WINEP_Schemes!D126","v":"7AW200172"},{"$f":"WINEP_Schemes!E126","v":"Great Ellingham STW"},{"$f":"WINEP_Schemes!F126","v":"£m"},{"$f":"WINEP_Schemes!G126","v":1},{"$f":"WINEP_Schemes!H126","v":0},{"$f":"WINEP_Schemes!J126","v":1},{"$f":"WINEP_Schemes!I126","v":0.22500000000000001},{"$f":"WINEP_Schemes!K126","v":1},{"$f":"WINEP_Schemes!L126","v":1},{"$f":"WINEP_Schemes!M126","v":"WWN"},{"$f":"WINEP_Schemes!N126","v":1},0.22500000000000001,0.22500000000000001,0,0,0,0,0,0]
[null,null,{"$f":"WINEP_Schemes!C127","v":"EAN00595"},{"$f":"WINEP_Schemes!D127","v":"7AW200173"},{"$f":"WINEP_Schemes!E127","v":"Great Gidding STW"},{"$f":"WINEP_Schemes!F127","v":"£m"},{"$f":"WINEP_Schemes!G127","v":1},{"$f":"WINEP_Schemes!H127","v":0},{"$f":"WINEP_Schemes!J127","v":1},{"$f":"WINEP_Schemes!I127","v":1.478},{"$f":"WINEP_Schemes!K127","v":1},{"$f":"WINEP_Schemes!L127","v":1},{"$f":"WINEP_Schemes!M127","v":"WWN"},{"$f":"WINEP_Schemes!N127","v":1},1.478,1.478,0,0,0,0,0,0]
[null,null,{"$f":"WINEP_Schemes!C128","v":"EAN00597"},{"$f":"WINEP_Schemes!D128","v":"7AW200175"},{"$f":"WINEP_Schemes!E128","v":"Helmdon STW"},{"$f":"WINEP_Schemes!F128","v":"£m"},{"$f":"WINEP_Schemes!G128","v":1},{"$f":"WINEP_Schemes!H128","v":0},{"$f":"WINEP_Schemes!J128","v":1},{"$f":"WINEP_Schemes!I128","v":0.84899999999999998},{"$f":"WINEP_Schemes!K128","v":1},{"$f":"WINEP_Schemes!L128","v":1},{"$f":"WINEP_Schemes!M128","v":"WWN"},{"$f":"WINEP_Schemes!N128","v":1},0.84899999999999998,0.84899999999999998,0,0,0,0,0,0]
[null,null,{"$f":"WINEP_Schemes!C129","v":"EAN00598"},{"$f":"WINEP_Schemes!D129","v":"7AW200176"},{"$f":"WINEP_Schemes!E129","v":"Marston Moretaine STW"},{"$f":"WINEP_Schemes!F129","v":"£m"},{"$f":"WINEP_Schemes!G129","v":1},{"$f":"WINEP_Schemes!H129","v":0},{"$f":"WINEP_Schemes!J129","v":1},{"$f":"WINEP_Schemes!I129","v":1.8440000000000001},{"$f":"WINEP_Schemes!K129","v":1},{"$f":"WINEP_Schemes!L129","v":1},{"$f":"WINEP_Schemes!M129","v":"WWN"},{"$f":"WINEP_Schemes!N129","v":1},1.8440000000000001,1.8440000000000001,0,{"$f":" IF($M130 = R$9, $Q130, 0)","v":0},0,0,0,0]
[null,null,{"$f":"WINEP_Schemes!C130","v":"EAN00600"},{"$f":"WINEP_Schemes!D130","v":"7AW200178"},{"$f":"WINEP_Schemes!E130","v":"Old Buckenham STW"},{"$f":"WINEP_Schemes!F130","v":"£m"},{"$f":"WINEP_Schemes!G130","v":1},{"$f":"WINEP_Schemes!H130","v":0},{"$f":"WINEP_Schemes!J130","v":1},{"$f":"WINEP_Schemes!I130","v":0.09},{"$f":"WINEP_Schemes!K130","v":1},{"$f":"WINEP_Schemes!L130","v":1},{"$f":"WINEP_Schemes!M130","v":"WWN"},{"$f":"WINEP_Schemes!N130","v":1},0.09,0.09,0,0,0,0,0,0]
[null,null,{"$f":"WINEP_Schemes!C131","v":"EAN00601"},{"$f":"WINEP_Schemes!D131","v":"7AW200179"},{"$f":"WINEP_Schemes!E131","v":"Old Weston STW"},{"$f":"WINEP_Schemes!F131","v":"£m"},{"$f":"WINEP_Schemes!G131","v":1},{"$f":"WINEP_Schemes!H131","v":0},{"$f":"WINEP_Schemes!J131","v":1},{"$f":"WINEP_Schemes!I131","v":1.254},{"$f":"WINEP_Schemes!K131","v":1},{"$f":"WINEP_Schemes!L131","v":1},{"$f":"WINEP_Schemes!M131","v":"WWN"},{"$f":"WINEP_Schemes!N131","v":1},1.254,1.254,0,0,0,0,0,0]
[null,null,{"$f":"WINEP_Schemes!C132","v":"EAN00604"},{"$f":"WINEP_Schemes!D132","v":"7AW200182"},{"$f":"WINEP_Schemes!E132","v":"Thetford STW"},{"$f":"WINEP_Schemes!F132","v":"£m"},{"$f":"WINEP_Schemes!G132","v":1},{"$f":"WINEP_Schemes!H132","v":0},{"$f":"WINEP_Schemes!J132","v":1},{"$f":"WINEP_Schemes!I132","v":0.38700000000000001},{"$f":"WINEP_Schemes!K132","v":1},{"$f":"WINEP_Schemes!L132","v":1},{"$f":"WINEP_Schemes!M132","v":"WWN"},{"$f":"WINEP_Schemes!N132","v":1},0.38700000000000001,0.38700000000000001,0,0,0,0,0,0]
[null,null,{"$f":"WINEP_Schemes!C133","v":"EAN00623"},{"$f":"WINEP_Schemes!D133","v":"7AW200201"},{"$f":"WINEP_Schemes!E133","v":"Debenham STW"},{"$f":"WINEP_Schemes!F133","v":"£m"},{"$f":"WINEP_Schemes!G133","v":1},{"$f":"WINEP_Schemes!H133","v":0},{"$f":"WINEP_Schemes!J133","v":1},{"$f":"WINEP_Schemes!I133","v":0.65200000000000002},{"$f":"WINEP_Schemes!K133","v":1},{"$f":"WINEP_Schemes!L133","v":1},{"$f":"WINEP_Schemes!M133","v":"WWN"},{"$f":"WINEP_Schemes!N133","v":1},0.65200000000000002,0.65200000000000002,0,0,0,0,0,0]
[null,null,{"$f":"WINEP_Schemes!C134","v":"EAN00624"},{"$f":"WINEP_Schemes!D134","v":"7AW200202"},{"$f":"WINEP_Schemes!E134","v":"Earl Soham STW"},{"$f":"WINEP_Schemes!F134","v":"£m"},{"$f":"WINEP_Schemes!G134","v":1},{"$f":"WINEP_Schemes!H134","v":0},{"$f":"WINEP_Schemes!J134","v":1},{"$f":"WINEP_Schemes!I134","v":1.335},{"$f":"WINEP_Schemes!K134","v":1},{"$f":"WINEP_Schemes!L134","v":1},{"$f":"WINEP_Schemes!M134","v":"WWN"},{"$f":"WINEP_Schemes!N134","v":1},1.335,1.335,0,0,0,0,0,0]
[null,null,{"$f":"WINEP_Schemes!C135","v":"EAN00628"},{"$f":"WINEP_Schemes!D135","v":"7AW200206"},{"$f":"WINEP_Schemes!E135","v":"Rendlesham Park STW"},{"$f":"WINEP_Schemes!F135","v":"£m"},{"$f":"WINEP_Schemes!G135","v":1},{"$f":"WINEP_Schemes!H135","v":0},{"$f":"WINEP_Schemes!J135","v":1},{"$f":"WINEP_Schemes!I135","v":0.09},{"$f":"WINEP_Schemes!K135","v":1},{"$f":"WINEP_Schemes!L135","v":1},{"$f":"WINEP_Schemes!M135","v":"WWN"},{"$f":"WINEP_Schemes!N135","v":1},0.09,0.09,0,0,0,0,0,0]
[null,null,{"$f":"WINEP_Schemes!C136","v":"EAN00629"},{"$f":"WINEP_Schemes!D136","v":"7AW200207"},{"$f":"WINEP_Schemes!E136","v":"Wickham Market STW"},{"$f":"WINEP_Schemes!F136","v":"£m"},{"$f":"WINEP_Schemes!G136","v":1},{"$f":"WINEP_Schemes!H136","v":0},{"$f":"WINEP_Schemes!J136","v":1},{"$f":"WINEP_Schemes!I136","v":0.63700000000000001},{"$f":"WINEP_Schemes!K136","v":1},{"$f":"WINEP_Schemes!L136","v":1},{"$f":"WINEP_Schemes!M136","v":"WWN"},{"$f":"WINEP_Schemes!N136","v":1},0.63700000000000001,0.63700000000000001,0,0,0,0,0,0]
[null,null,{"$f":"WINEP_Schemes!C137","v":"EAN00630"},{"$f":"WINEP_Schemes!D137","v":"7AW200208"},{"$f":"WINEP_Schemes!E137","v":"Earls Colne STW"},{"$f":"WINEP_Schemes!F137","v":"£m"},{"$f":"WINEP_Schemes!G137","v":1},{"$f":"WINEP_Schemes!H137","v":0},{"$f":"WINEP_Schemes!J137","v":1},{"$f":"WINEP_Schemes!I137","v":2.085},{"$f":"WINEP_Schemes!K137","v":1},{"$f":"WINEP_Schemes!L137","v":1},{"$f":"WINEP_Schemes!M137","v":"WWN"},{"$f":"WINEP_Schemes!N137","v":1},2.085,2.085,0,0,0,0,0,0]
[null,null,{"$f":"WINEP_Schemes!C138","v":"EAN00631"},{"$f":"WINEP_Schemes!D138","v":"7AW200209"},{"$f":"WINEP_Schemes!E138","v":"Ridgewell STW"},{"$f":"WINEP_Schemes!F138","v":"£m"},{"$f":"WINEP_Schemes!G138","v":1},{"$f":"WINEP_Schemes!H138","v":0},{"$f":"WINEP_Schemes!J138","v":1},{"$f":"WINEP_Schemes!I138","v":0.157},{"$f":"WINEP_Schemes!K138","v":1},{"$f":"WINEP_Schemes!L138","v":1},{"$f":"WINEP_Schemes!M138","v":"WWN"},{"$f":"WINEP_Schemes!N138","v":1},0.157,0.157,0,0,0,0,0,0]
[null,null,{"$f":"WINEP_Schemes!C139","v":"EAN00632"},{"$f":"WINEP_Schemes!D139","v":"7AW200210"},{"$f":"WINEP_Schemes!E139","v":"Stambourne STW"},{"$f":"WINEP_Schemes!F139","v":"£m"},{"$f":"WINEP_Schemes!G139","v":1},{"$f":"WINEP_Schemes!H139","v":0},{"$f":"WINEP_Schemes!J139","v":1},{"$f":"WINEP_Schemes!I139","v":2.343},{"$f":"WINEP_Schemes!K139","v":1},{"$f":"WINEP_Schemes!L139","v":1},{"$f":"WINEP_Schemes!M139","v":"WWN"},{"$f":"WINEP_Schemes!N139","v":1},2.343,2.343,0,0,0,0,0,0]
[null,null,{"$f":"WINEP_Schemes!C140","v":"EAN00633"},{"$f":"WINEP_Schemes!D140","v":"7AW200211"},{"$f":"WINEP_Schemes!E140","v":"West Bergholt STW"},{"$f":"WINEP_Schemes!F140","v":"£m"},{"$f":"WINEP_Schemes!G140","v":1},{"$f":"WINEP_Schemes!H140","v":0},{"$f":"WINEP_Schemes!J140","v":1},{"$f":"WINEP_Schemes!I140","v":2.06},{"$f":"WINEP_Schemes!K140","v":1},{"$f":"WINEP_Schemes!L140","v":1},{"$f":"WINEP_Schemes!M140","v":"WWN"},{"$f":"WINEP_Schemes!N140","v":1},2.06,2.06,0,0,0,0,0,0]
[null,null,{"$f":"WINEP_Schemes!C141","v":"EAN00634"},{"$f":"WINEP_Schemes!D141","v":"7AW200212"},{"$f":"WINEP_Schemes!E141","v":"Eight Ash Green STW"},{"$f":"WINEP_Schemes!F141","v":"£m"},{"$f":"WINEP_Schemes!G141","v":1},{"$f":"WINEP_Schemes!H141","v":0},{"$f":"WINEP_Schemes!J141","v":1},{"$f":"WINEP_Schemes!I141","v":1.93},{"$f":"WINEP_Schemes!K141","v":1},{"$f":"WINEP_Schemes!L141","v":1},{"$f":"WINEP_Schemes!M141","v":"WWN"},{"$f":"WINEP_Schemes!N141","v":1},1.93,1.93,0,0,0,0,0,0]
[null,null,{"$f":"WINEP_Schemes!C142","v":"EAN00635"},{"$f":"WINEP_Schemes!D142","v":"7AW200213"},{"$f":"WINEP_Schemes!E142","v":"Gosfield STW"},{"$f":"WINEP_Schemes!F142","v":"£m"},{"$f":"WINEP_Schemes!G142","v":1},{"$f":"WINEP_Schemes!H142","v":0},{"$f":"WINEP_Schemes!J142","v":1},{"$f":"WINEP_Schemes!I142","v":2.8559999999999999},{"$f":"WINEP_Schemes!K142","v":1},{"$f":"WINEP_Schemes!L142","v":1},{"$f":"WINEP_Schemes!M142","v":"WWN"},{"$f":"WINEP_Schemes!N142","v":1},2.8559999999999999,2.8559999999999999,0,0,0,0,0,0]
[null,null,{"$f":"WINEP_Schemes!C143","v":"EAN00636"},{"$f":"WINEP_Schemes!D143","v":"7AW200214"},{"$f":"WINEP_Schemes!E143","v":"Great Bromley STW"},{"$f":"WINEP_Schemes!F143","v":"£m"},{"$f":"WINEP_Schemes!G143","v":1},{"$f":"WINEP_Schemes!H143","v":0},{"$f":"WINEP_Schemes!J143","v":1},{"$f":"WINEP_Schemes!I143","v":2.9340000000000002},{"$f":"WINEP_Schemes!K143","v":1},{"$f":"WINEP_Schemes!L143","v":1},{"$f":"WINEP_Schemes!M143","v":"WWN"},{"$f":"WINEP_Schemes!N143","v":1},2.9340000000000002,2.9340000000000002,0,0,0,0,0,0]
[null,null,{"$f":"WINEP_Schemes!C144","v":"EAN00637"},{"$f":"WINEP_Schemes!D144","v":"7AW200215"},{"$f":"WINEP_Schemes!E144","v":"Halstead (Langley) STW"},{"$f":"WINEP_Schemes!F144","v":0},{"$f":"WINEP_Schemes!G144","v":0},{"$f":"WINEP_Schemes!H144","v":0},{"$f":"WINEP_Schemes!J144","v":0},{"$f":"WINEP_Schemes!I144","v":0},{"$f":"WINEP_Schemes!K144","v":0},{"$f":"WINEP_Schemes!L144","v":0},{"$f":"WINEP_Schemes!M144","v":0},{"$f":"WINEP_Schemes!N144","v":0},{"$f":" I145 * J145 * G145","v":0},{"$f":" N145 * O145","v":0},{"$f":" IF(L145 = 0, P145, (N145 - 1) * O145)","v":0},0,0,0,0,0]
[null,null,{"$f":"WINEP_Schemes!C145","v":"EAN00638"},{"$f":"WINEP_Schemes!D145","v":"7AW200216"},{"$f":"WINEP_Schemes!E145","v":"Sible Hedingham STW"},{"$f":"WINEP_Schemes!F145","v":"£m"},{"$f":"WINEP_Schemes!G145","v":1},{"$f":"WINEP_Schemes!H145","v":0},{"$f":"WINEP_Schemes!J145","v":1},{"$f":"WINEP_Schemes!I145","v":3.8159999999999998},{"$f":"WINEP_Schemes!K145","v":1},{"$f":"WINEP_Schemes!L145","v":1},{"$f":"WINEP_Schemes!M145","v":"WWN"},{"$f":"WINEP_Schemes!N145","v":1},3.8159999999999998,3.8159999999999998,0,0,0,0,0,0]
[null,null,{"$f":"WINEP_Schemes!C146","v":"EAN00639"},{"$f":"WINEP_Schemes!D146","v":"7AW200217"},{"$f":"WINEP_Schemes!E146","v":"Thorrington STW"},{"$f":"WINEP_Schemes!F146","v":"£m"},{"$f":"WINEP_Schemes!G146","v":1},{"$f":"WINEP_Schemes!H146","v":0},{"$f":"WINEP_Schemes!J146","v":1},{"$f":"WINEP_Schemes!I146","v":3.528},{"$f":"WINEP_Schemes!K146","v":1},{"$f":"WINEP_Schemes!L146","v":1},{"$f":"WINEP_Schemes!M146","v":"WWN"},{"$f":"WINEP_Schemes!N146","v":1},3.528,3.528,0,0,0,0,0,0]
[null,null,{"$f":"WINEP_Schemes!C147","v":"EAN00650"},{"$f":"WINEP_Schemes!D147","v":"7AW200228"},{"$f":"WINEP_Schemes!E147","v":"Sisland (Loddon) STW"},{"$f":"WINEP_Schemes!F147","v":"£m"},{"$f":"WINEP_Schemes!G147","v":1},{"$f":"WINEP_Schemes!H147","v":0},{"$f":"WINEP_Schemes!J147","v":1},{"$f":"WINEP_Schemes!I147","v":1.97},{"$f":"WINEP_Schemes!K147","v":1},{"$f":"WINEP_Schemes!L147","v":1},{"$f":"WINEP_Schemes!M147","v":"WWN"},{"$f":"WINEP_Schemes!N147","v":1},1.97,1.97,0,0,0,0,0,0]
[null,null,{"$f":"WINEP_Schemes!C148","v":"EAN00651"},{"$f":"WINEP_Schemes!D148","v":"7AW200229"},{"$f":"WINEP_Schemes!E148","v":"Swardeston STW"},{"$f":"WINEP_Schemes!F148","v":0},{"$f":"WINEP_Schemes!G148","v":0},{"$f":"WINEP_Schemes!H148","v":0},{"$f":"WINEP_Schemes!J148","v":0},{"$f":"WINEP_Schemes!I148","v":0},{"$f":"WINEP_Schemes!K148","v":0},{"$f":"WINEP_Schemes!L148","v":0},{"$f":"WINEP_Schemes!M148","v":0},{"$f":"WINEP_Schemes!N148","v":0},0,0,0,0,0,0,0,0]
[null,null,{"$f":"WINEP_Schemes!C149","v":"EAN00663"},{"$f":"WINEP_Schemes!D149","v":"7AW200241"},{"$f":"WINEP_Schemes!E149","v":"Billericay (Outwood) STW"},{"$f":"WINEP_Schemes!F149","v":0},{"$f":"WINEP_Schemes!G149","v":0},{"$f":"WINEP_Schemes!H149","v":0},{"$f":"WINEP_Schemes!J149","v":0},{"$f":"WINEP_Schemes!I149","v":0},{"$f":"WINEP_Schemes!K149","v":0},{"$f":"WINEP_Schemes!L149","v":0},{"$f":"WINEP_Schemes!M149","v":0},{"$f":"WINEP_Schemes!N149","v":0},0,0,0,0,0,0,0,0]
[null,null,{"$f":"WINEP_Schemes!C150","v":"EAN00685"},{"$f":"WINEP_Schemes!D150","v":"7AW200263"},{"$f":"WINEP_Schemes!E150","v":"Mablethorpe STW"},{"$f":"WINEP_Schemes!F150","v":0},{"$f":"WINEP_Schemes!G150","v":0},{"$f":"WINEP_Schemes!H150","v":0},{"$f":"WINEP_Schemes!J150","v":0},{"$f":"WINEP_Schemes!I150","v":0},{"$f":"WINEP_Schemes!K150","v":0},{"$f":"WINEP_Schemes!L150","v":0},{"$f":"WINEP_Schemes!M150","v":0},{"$f":"WINEP_Schemes!N150","v":0},0,0,0,0,0,0,0,0]
[null,null,{"$f":"WINEP_Schemes!C151","v":"EAN02349"},{"$f":"WINEP_Schemes!D151","v":"7AW201925"},{"$f":"WINEP_Schemes!E151","v":"Burrough Green STW"},{"$f":"WINEP_Schemes!F151","v":"£m"},{"$f":"WINEP_Schemes!G151","v":1},{"$f":"WINEP_Schemes!H151","v":0},{"$f":"WINEP_Schemes!J151","v":1},{"$f":"WINEP_Schemes!I151","v":2.351},{"$f":"WINEP_Schemes!K151","v":1},{"$f":"WINEP_Schemes!L151","v":1},{"$f":"WINEP_Schemes!M151","v":"WWN"},{"$f":"WINEP_Schemes!N151","v":1},2.351,2.351,0,0,0,0,0,0]
[null,null,{"$f":"WINEP_Schemes!C152","v":"EAN02350"},{"$f":"WINEP_Schemes!D152","v":"7AW201926"},{"$f":"WINEP_Schemes!E152","v":"Stradishall - Highpoint STW"},{"$f":"WINEP_Schemes!F152","v":"£m"},{"$f":"WINEP_Schemes!G152","v":1},{"$f":"WINEP_Schemes!H152","v":0},{"$f":"WINEP_Schemes!J152","v":1},{"$f":"WINEP_Schemes!I152","v":2.5670000000000002},{"$f":"WINEP_Schemes!K152","v":1},{"$f":"WINEP_Schemes!L152","v":1},{"$f":"WINEP_Schemes!M152","v":"WWN"},{"$f":"WINEP_Schemes!N152","v":1},2.5670000000000002,2.5670000000000002,0,0,0,0,0,0]
[null,null,{"$f":"WINEP_Schemes!C153","v":"EAN02352"},{"$f":"WINEP_Schemes!D153","v":"7AW201928"},{"$f":"WINEP_Schemes!E153","v":"Great Cornard STW"},{"$f":"WINEP_Schemes!F153","v":"£m"},{"$f":"WINEP_Schemes!G153","v":1},{"$f":"WINEP_Schemes!H153","v":0},{"$f":"WINEP_Schemes!J153","v":1},{"$f":"WINEP_Schemes!I153","v":4.157},{"$f":"WINEP_Schemes!K153","v":1},{"$f":"WINEP_Schemes!L153","v":1},{"$f":"WINEP_Schemes!M153","v":"WWN"},{"$f":"WINEP_Schemes!N153","v":1},4.157,4.157,0,0,0,0,0,0]
[null,null,{"$f":"WINEP_Schemes!C154","v":"EAN02353"},{"$f":"WINEP_Schemes!D154","v":"7AW201929"},{"$f":"WINEP_Schemes!E154","v":"Great Waldingfield STW"},{"$f":"WINEP_Schemes!F154","v":"£m"},{"$f":"WINEP_Schemes!G154","v":1},{"$f":"WINEP_Schemes!H154","v":0},{"$f":"WINEP_Schemes!J154","v":1},{"$f":"WINEP_Schemes!I154","v":2.66},{"$f":"WINEP_Schemes!K154","v":1},{"$f":"WINEP_Schemes!L154","v":1},{"$f":"WINEP_Schemes!M154","v":"WWN"},{"$f":"WINEP_Schemes!N154","v":1},2.66,2.66,0,0,0,0,0,0]
[null,null,{"$f":"WINEP_Schemes!C155","v":"EAN02354"},{"$f":"WINEP_Schemes!D155","v":"7AW201930"},{"$f":"WINEP_Schemes!E155","v":"Hadleigh STW"},{"$f":"WINEP_Schemes!F155","v":"£m"},{"$f":"WINEP_Schemes!G155","v":1},{"$f":"WINEP_Schemes!H155","v":0},{"$f":"WINEP_Schemes!J155","v":1},{"$f":"WINEP_Schemes!I155","v":3.2749999999999999},{"$f":"WINEP_Schemes!K155","v":1},{"$f":"WINEP_Schemes!L155","v":1},{"$f":"WINEP_Schemes!M155","v":"WWN"},{"$f":"WINEP_Schemes!N155","v":1},3.2749999999999999,3.2749999999999999,0,0,0,0,0,0]
[null,null,{"$f":"WINEP_Schemes!C156","v":"EAN02355"},{"$f":"WINEP_Schemes!D156","v":"7AW201931"},{"$f":"WINEP_Schemes!E156","v":"Haverhill STW"},{"$f":"WINEP_Schemes!F156","v":"£m"},{"$f":"WINEP_Schemes!G156","v":1},{"$f":"WINEP_Schemes!H156","v":0},{"$f":"WINEP_Schemes!J156","v":1},{"$f":"WINEP_Schemes!I156","v":7.2969999999999997},{"$f":"WINEP_Schemes!K156","v":1},{"$f":"WINEP_Schemes!L156","v":1},{"$f":"WINEP_Schemes!M156","v":"WWN"},{"$f":"WINEP_Schemes!N156","v":1},7.2969999999999997,7.2969999999999997,0,0,0,0,0,0]
[null,null,{"$f":"WINEP_Schemes!C157","v":"EAN02356"},{"$f":"WINEP_Schemes!D157","v":"7AW201932"},{"$f":"WINEP_Schemes!E157","v":"Hundon STW"},{"$f":"WINEP_Schemes!F157","v":"£m"},{"$f":"WINEP_Schemes!G157","v":1},{"$f":"WINEP_Schemes!H157","v":0},{"$f":"WINEP_Schemes!J157","v":1},{"$f":"WINEP_Schemes!I157","v":2.8130000000000002},{"$f":"WINEP_Schemes!K157","v":1},{"$f":"WINEP_Schemes!L157","v":1},{"$f":"WINEP_Schemes!M157","v":"WWN"},{"$f":"WINEP_Schemes!N157","v":1},2.8130000000000002,2.8130000000000002,0,0,0,0,0,0]
[null,null,{"$f":"WINEP_Schemes!C158","v":"EAN02357"},{"$f":"WINEP_Schemes!D158","v":"7AW201933"},{"$f":"WINEP_Schemes!E158","v":"Kedington STW"},{"$f":"WINEP_Schemes!F158","v":"£m"},{"$f":"WINEP_Schemes!G158","v":1},{"$f":"WINEP_Schemes!H158","v":0},{"$f":"WINEP_Schemes!J158","v":1},{"$f":"WINEP_Schemes!I158","v":0.09},{"$f":"WINEP_Schemes!K158","v":1},{"$f":"WINEP_Schemes!L158","v":1},{"$f":"WINEP_Schemes!M158","v":"WWN"},{"$f":"WINEP_Schemes!N158","v":1},0.09,0.09,0,0,0,0,0,0]
[null,null,{"$f":"WINEP_Schemes!C159","v":"EAN02358"},{"$f":"WINEP_Schemes!D159","v":"7AW201934"},{"$f":"WINEP_Schemes!E159","v":"Langham (Essex) STW"},{"$f":"WINEP_Schemes!F159","v":"£m"},{"$f":"WINEP_Schemes!G159","v":1},{"$f":"WINEP_Schemes!H159","v":0},{"$f":"WINEP_Schemes!J159","v":1},{"$f":"WINEP_Schemes!I159","v":0.97599999999999998},{"$f":"WINEP_Schemes!K159","v":1},{"$f":"WINEP_Schemes!L159","v":1},{"$f":"WINEP_Schemes!M159","v":"WWN"},{"$f":"WINEP_Schemes!N159","v":1},0.97599999999999998,0.97599999999999998,0,0,0,0,0,0]
[null,null,{"$f":"WINEP_Schemes!C160","v":"EAN02360"},{"$f":"WINEP_Schemes!D160","v":"7AW201936"},{"$f":"WINEP_Schemes!E160","v":"Steeple Bumpstead STW"},{"$f":"WINEP_Schemes!F160","v":"£m"},{"$f":"WINEP_Schemes!G160","v":1},{"$f":"WINEP_Schemes!H160","v":0},{"$f":"WINEP_Schemes!J160","v":1},{"$f":"WINEP_Schemes!I160","v":1.8380000000000001},{"$f":"WINEP_Schemes!K160","v":1},{"$f":"WINEP_Schemes!L160","v":1},{"$f":"WINEP_Schemes!M160","v":"WWN"},{"$f":"WINEP_Schemes!N160","v":1},1.8380000000000001,1.8380000000000001,0,0,0,0,0,0]
[null,null,{"$f":"WINEP_Schemes!C161","v":"EAN02361"},{"$f":"WINEP_Schemes!D161","v":"7AW201937"},{"$f":"WINEP_Schemes!E161","v":"Sudbury STW"},{"$f":"WINEP_Schemes!F161","v":"£m"},{"$f":"WINEP_Schemes!G161","v":1},{"$f":"WINEP_Schemes!H161","v":0},{"$f":"WINEP_Schemes!J161","v":1},{"$f":"WINEP_Schemes!I161","v":1.8380000000000001},{"$f":"WINEP_Schemes!K161","v":1},{"$f":"WINEP_Schemes!L161","v":1},{"$f":"WINEP_Schemes!M161","v":"WWN"},{"$f":"WINEP_Schemes!N161","v":1},1.8380000000000001,1.8380000000000001,0,0,0,0,0,0]
[null,null,{"$f":"WINEP_Schemes!C162","v":"EAN02362"},{"$f":"WINEP_Schemes!D162","v":"7AW201938"},{"$f":"WINEP_Schemes!E162","v":"Thurlow STW"},{"$f":"WINEP_Schemes!F162","v":"£m"},{"$f":"WINEP_Schemes!G162","v":1},{"$f":"WINEP_Schemes!H162","v":0},{"$f":"WINEP_Schemes!J162","v":1},{"$f":"WINEP_Schemes!I162","v":0.22500000000000001},{"$f":"WINEP_Schemes!K162","v":1},{"$f":"WINEP_Schemes!L162","v":1},{"$f":"WINEP_Schemes!M162","v":"WWN"},{"$f":"WINEP_Schemes!N162","v":1},0.22500000000000001,0.22500000000000001,0,0,0,0,0,0]
[null,null,{"$f":"WINEP_Schemes!C163","v":"EAN02363"},{"$f":"WINEP_Schemes!D163","v":"7AW201939"},{"$f":"WINEP_Schemes!E163","v":"Wickham Brook STW"},{"$f":"WINEP_Schemes!F163","v":"£m"},{"$f":"WINEP_Schemes!G163","v":1},{"$f":"WINEP_Schemes!H163","v":0},{"$f":"WINEP_Schemes!J163","v":1},{"$f":"WINEP_Schemes!I163","v":1.1990000000000001},{"$f":"WINEP_Schemes!K163","v":1},{"$f":"WINEP_Schemes!L163","v":1},{"$f":"WINEP_Schemes!M163","v":"WWN"},{"$f":"WINEP_Schemes!N163","v":1},1.1990000000000001,1.1990000000000001,0,0,0,0,0,0]
[null,null,{"$f":"WINEP_Schemes!C164","v":"EAN02364"},{"$f":"WINEP_Schemes!D164","v":"7AW201940"},{"$f":"WINEP_Schemes!E164","v":"Withersfield STW"},{"$f":"WINEP_Schemes!F164","v":"£m"},{"$f":"WINEP_Schemes!G164","v":1},{"$f":"WINEP_Schemes!H164","v":0},{"$f":"WINEP_Schemes!J164","v":1},{"$f":"WINEP_Schemes!I164","v":1.3680000000000001},{"$f":"WINEP_Schemes!K164","v":1},{"$f":"WINEP_Schemes!L164","v":1},{"$f":"WINEP_Schemes!M164","v":"WWN"},{"$f":"WINEP_Schemes!N164","v":1},1.3680000000000001,1.3680000000000001,0,0,0,0,0,0]
[null,null,{"$f":"WINEP_Schemes!C165","v":"LNA00049"},{"$f":"WINEP_Schemes!D165","v":"7AW201955"},{"$f":"WINEP_Schemes!E165","v":"Brixworth STW"},{"$f":"WINEP_Schemes!F165","v":0},{"$f":"WINEP_Schemes!G165","v":0},{"$f":"WINEP_Schemes!H165","v":0},{"$f":"WINEP_Schemes!J165","v":0},{"$f":"WINEP_Schemes!I165","v":0},{"$f":"WINEP_Schemes!K165","v":0},{"$f":"WINEP_Schemes!L165","v":0},{"$f":"WINEP_Schemes!M165","v":0},{"$f":"WINEP_Schemes!N165","v":0},0,0,0,0,0,0,0,0]
[null,null,{"$f":"WINEP_Schemes!C166","v":"LNA00050"},{"$f":"WINEP_Schemes!D166","v":"7AW201956"},{"$f":"WINEP_Schemes!E166","v":"Broadholme STW"},{"$f":"WINEP_Schemes!F166","v":0},{"$f":"WINEP_Schemes!G166","v":0},{"$f":"WINEP_Schemes!H166","v":0},{"$f":"WINEP_Schemes!J166","v":0},{"$f":"WINEP_Schemes!I166","v":0},{"$f":"WINEP_Schemes!K166","v":0},{"$f":"WINEP_Schemes!L166","v":0},{"$f":"WINEP_Schemes!M166","v":0},{"$f":"WINEP_Schemes!N166","v":0},0,0,0,0,0,0,0,0]
[null,null,{"$f":"WINEP_Schemes!C167","v":"LNA00054"},{"$f":"WINEP_Schemes!D167","v":"7AW201960"},{"$f":"WINEP_Schemes!E167","v":"Clipston STW"},{"$f":"WINEP_Schemes!F167","v":"£m"},{"$f":"WINEP_Schemes!G167","v":1},{"$f":"WINEP_Schemes!H167","v":0},{"$f":"WINEP_Schemes!J167","v":1},{"$f":"WINEP_Schemes!I167","v":3.5579999999999998},{"$f":"WINEP_Schemes!K167","v":1},{"$f":"WINEP_Schemes!L167","v":1},{"$f":"WINEP_Schemes!M167","v":"WWN"},{"$f":"WINEP_Schemes!N167","v":1},3.5579999999999998,3.5579999999999998,0,0,0,0,0,0]
[null,null,{"$f":"WINEP_Schemes!C168","v":"LNA00055"},{"$f":"WINEP_Schemes!D168","v":"7AW201961"},{"$f":"WINEP_Schemes!E168","v":"Corby STW"},{"$f":"WINEP_Schemes!F168","v":0},{"$f":"WINEP_Schemes!G168","v":0},{"$f":"WINEP_Schemes!H168","v":0},{"$f":"WINEP_Schemes!J168","v":0},{"$f":"WINEP_Schemes!I168","v":0},{"$f":"WINEP_Schemes!K168","v":0},{"$f":"WINEP_Schemes!L168","v":0},{"$f":"WINEP_Schemes!M168","v":0},{"$f":"WINEP_Schemes!N168","v":0},0,0,0,0,0,0,0,0]
[null,null,{"$f":"WINEP_Schemes!C169","v":"LNA00057"},{"$f":"WINEP_Schemes!D169","v":"7AW201963"},{"$f":"WINEP_Schemes!E169","v":"Draughton STW"},{"$f":"WINEP_Schemes!F169","v":"£m"},{"$f":"WINEP_Schemes!G169","v":1},{"$f":"WINEP_Schemes!H169","v":0},{"$f":"WINEP_Schemes!J169","v":1},{"$f":"WINEP_Schemes!I169","v":3.6179999999999999},{"$f":"WINEP_Schemes!K169","v":1},{"$f":"WINEP_Schemes!L169","v":1},{"$f":"WINEP_Schemes!M169","v":"WWN"},{"$f":"WINEP_Schemes!N169","v":1},3.6179999999999999,3.6179999999999999,0,0,0,0,0,0]
[null,null,{"$f":"WINEP_Schemes!C170","v":"LNA00058"},{"$f":"WINEP_Schemes!D170","v":"7AW201964"},{"$f":"WINEP_Schemes!E170","v":"East Haddon STW"},{"$f":"WINEP_Schemes!F170","v":"£m"},{"$f":"WINEP_Schemes!G170","v":1},{"$f":"WINEP_Schemes!H170","v":0},{"$f":"WINEP_Schemes!J170","v":1},{"$f":"WINEP_Schemes!I170","v":1.8580000000000001},{"$f":"WINEP_Schemes!K170","v":1},{"$f":"WINEP_Schemes!L170","v":1},{"$f":"WINEP_Schemes!M170","v":"WWN"},{"$f":"WINEP_Schemes!N170","v":1},1.8580000000000001,1.8580000000000001,0,0,0,0,0,0]
[null,null,{"$f":"WINEP_Schemes!C171","v":"LNA00060"},{"$f":"WINEP_Schemes!D171","v":"7AW201966"},{"$f":"WINEP_Schemes!E171","v":"Geddington STW"},{"$f":"WINEP_Schemes!F171","v":"£m"},{"$f":"WINEP_Schemes!G171","v":1},{"$f":"WINEP_Schemes!H171","v":0},{"$f":"WINEP_Schemes!J171","v":1},{"$f":"WINEP_Schemes!I171","v":1.762},{"$f":"WINEP_Schemes!K171","v":1},{"$f":"WINEP_Schemes!L171","v":1},{"$f":"WINEP_Schemes!M171","v":"WWN"},{"$f":"WINEP_Schemes!N171","v":1},1.762,1.762,0,0,0,0,0,0]
[null,null,{"$f":"WINEP_Schemes!C172","v":"LNA00062"},{"$f":"WINEP_Schemes!D172","v":"7AW201968"},{"$f":"WINEP_Schemes!E172","v":"Great Oxendon STW"},{"$f":"WINEP_Schemes!F172","v":"£m"},{"$f":"WINEP_Schemes!G172","v":1},{"$f":"WINEP_Schemes!H172","v":0},{"$f":"WINEP_Schemes!J172","v":1},{"$f":"WINEP_Schemes!I172","v":2.875},{"$f":"WINEP_Schemes!K172","v":1},{"$f":"WINEP_Schemes!L172","v":1},{"$f":"WINEP_Schemes!M172","v":"WWN"},{"$f":"WINEP_Schemes!N172","v":1},2.875,2.875,0,0,0,0,0,0]
[null,null,{"$f":"WINEP_Schemes!C173","v":"LNA00063"},{"$f":"WINEP_Schemes!D173","v":"7AW201969"},{"$f":"WINEP_Schemes!E173","v":"Hackleton STW"},{"$f":"WINEP_Schemes!F173","v":"£m"},{"$f":"WINEP_Schemes!G173","v":1},{"$f":"WINEP_Schemes!H173","v":0},{"$f":"WINEP_Schemes!J173","v":1},{"$f":"WINEP_Schemes!I173","v":1.911},{"$f":"WINEP_Schemes!K173","v":1},{"$f":"WINEP_Schemes!L173","v":1},{"$f":"WINEP_Schemes!M173","v":"WWN"},{"$f":"WINEP_Schemes!N173","v":1},1.911,1.911,0,0,0,0,0,0]
[null,null,{"$f":"WINEP_Schemes!C174","v":"LNA00065"},{"$f":"WINEP_Schemes!D174","v":"7AW201971"},{"$f":"WINEP_Schemes!E174","v":"Hollowell STW"},{"$f":"WINEP_Schemes!F174","v":0},{"$f":"WINEP_Schemes!G174","v":0},{"$f":"WINEP_Schemes!H174","v":0},{"$f":"WINEP_Schemes!J174","v":0},{"$f":"WINEP_Schemes!I174","v":0},{"$f":"WINEP_Schemes!K174","v":0},{"$f":"WINEP_Schemes!L174","v":0},{"$f":"WINEP_Schemes!M174","v":0},{"$f":"WINEP_Schemes!N174","v":0},0,0,0,0,0,0,0,0]
[null,null,{"$f":"WINEP_Schemes!C175","v":"LNA00074"},{"$f":"WINEP_Schemes!D175","v":"7AW201980"},{"$f":"WINEP_Schemes!E175","v":"Ravensthorpe STW"},{"$f":"WINEP_Schemes!F175","v":"£m"},{"$f":"WINEP_Schemes!G175","v":1},{"$f":"WINEP_Schemes!H175","v":0},{"$f":"WINEP_Schemes!J175","v":1},{"$f":"WINEP_Schemes!I175","v":1.242},{"$f":"WINEP_Schemes!K175","v":1},{"$f":"WINEP_Schemes!L175","v":1},{"$f":"WINEP_Schemes!M175","v":"WWN"},{"$f":"WINEP_Schemes!N175","v":1},1.242,1.242,0,0,0,0,0,0]
[null,null,{"$f":"WINEP_Schemes!C176","v":"LNA00077"},{"$f":"WINEP_Schemes!D176","v":"7AW201983"},{"$f":"WINEP_Schemes!E176","v":"Titchmarsh STW"},{"$f":"WINEP_Schemes!F176","v":"£m"},{"$f":"WINEP_Schemes!G176","v":1},{"$f":"WINEP_Schemes!H176","v":0},{"$f":"WINEP_Schemes!J176","v":1},{"$f":"WINEP_Schemes!I176","v":1.284},{"$f":"WINEP_Schemes!K176","v":1},{"$f":"WINEP_Schemes!L176","v":1},{"$f":"WINEP_Schemes!M176","v":"WWN"},{"$f":"WINEP_Schemes!N176","v":1},1.284,1.284,0,0,0,0,0,0]
[null,null,{"$f":"WINEP_Schemes!C177","v":"LNA00081"},{"$f":"WINEP_Schemes!D177","v":"7AW201987"},{"$f":"WINEP_Schemes!E177","v":"Wittering STW"},{"$f":"WINEP_Schemes!F177","v":0},{"$f":"WINEP_Schemes!G177","v":0},{"$f":"WINEP_Schemes!H177","v":0},{"$f":"WINEP_Schemes!J177","v":0},{"$f":"WINEP_Schemes!I177","v":0},{"$f":"WINEP_Schemes!K177","v":0},{"$f":"WINEP_Schemes!L177","v":0},{"$f":"WINEP_Schemes!M177","v":0},{"$f":"WINEP_Schemes!N177","v":0},0,0,0,0,0,0,0,0]
[null,null,{"$f":"WINEP_Schemes!C178","v":"LNA00109"},{"$f":"WINEP_Schemes!D178","v":"7AW202005"},{"$f":"WINEP_Schemes!E178","v":"Alford STW"},{"$f":"WINEP_Schemes!F178","v":"£m"},{"$f":"WINEP_Schemes!G178","v":1},{"$f":"WINEP_Schemes!H178","v":0},{"$f":"WINEP_Schemes!J178","v":1},{"$f":"WINEP_Schemes!I178","v":3.137},{"$f":"WINEP_Schemes!K178","v":1},{"$f":"WINEP_Schemes!L178","v":1},{"$f":"WINEP_Schemes!M178","v":"WWN"},{"$f":"WINEP_Schemes!N178","v":1},3.137,3.137,0,0,0,0,0,0]
[null,null,{"$f":"WINEP_Schemes!C179","v":"LNA00112"},{"$f":"WINEP_Schemes!D179","v":"7AW202008"},{"$f":"WINEP_Schemes!E179","v":"Anderby STW"},{"$f":"WINEP_Schemes!F179","v":"£m"},{"$f":"WINEP_Schemes!G179","v":1},{"$f":"WINEP_Schemes!H179","v":0},{"$f":"WINEP_Schemes!J179","v":1},{"$f":"WINEP_Schemes!I179","v":1.2549999999999999},{"$f":"WINEP_Schemes!K179","v":1},{"$f":"WINEP_Schemes!L179","v":1},{"$f":"WINEP_Schemes!M179","v":"WWN"},{"$f":"WINEP_Schemes!N179","v":1},1.2549999999999999,1.2549999999999999,0,0,0,0,0,0]
[null,null,{"$f":"WINEP_Schemes!C180","v":"LNA00120"},{"$f":"WINEP_Schemes!D180","v":"7AW202016"},{"$f":"WINEP_Schemes!E180","v":"Caythorpe STW"},{"$f":"WINEP_Schemes!F180","v":"£m"},{"$f":"WINEP_Schemes!G180","v":1},{"$f":"WINEP_Schemes!H180","v":0},{"$f":"WINEP_Schemes!J180","v":1},{"$f":"WINEP_Schemes!I180","v":2.0409999999999999},{"$f":"WINEP_Schemes!K180","v":1},{"$f":"WINEP_Schemes!L180","v":1},{"$f":"WINEP_Schemes!M180","v":"WWN"},{"$f":"WINEP_Schemes!N180","v":1},2.0409999999999999,2.0409999999999999,0,{"$f":" IF($M181 = R$9, $Q181, 0)","v":0},0,0,0,0]
[null,null,{"$f":"WINEP_Schemes!C181","v":"LNA00121"},{"$f":"WINEP_Schemes!D181","v":"7AW202017"},{"$f":"WINEP_Schemes!E181","v":"Colsterworth STW"},{"$f":"WINEP_Schemes!F181","v":"£m"},{"$f":"WINEP_Schemes!G181","v":1},{"$f":"WINEP_Schemes!H181","v":0},{"$f":"WINEP_Schemes!J181","v":1},{"$f":"WINEP_Schemes!I181","v":2.0760000000000001},{"$f":"WINEP_Schemes!K181","v":1},{"$f":"WINEP_Schemes!L181","v":1},{"$f":"WINEP_Schemes!M181","v":"WWN"},{"$f":"WINEP_Schemes!N181","v":1},2.0760000000000001,2.0760000000000001,0,0,0,0,0,0]
[null,null,{"$f":"WINEP_Schemes!C182","v":"LNA00123"},{"$f":"WINEP_Schemes!D182","v":"7AW202019"},{"$f":"WINEP_Schemes!E182","v":"Corringham STW"},{"$f":"WINEP_Schemes!F182","v":"£m"},{"$f":"WINEP_Schemes!G182","v":1},{"$f":"WINEP_Schemes!H182","v":0},{"$f":"WINEP_Schemes!J182","v":1},{"$f":"WINEP_Schemes!I182","v":1.5840000000000001},{"$f":"WINEP_Schemes!K182","v":1},{"$f":"WINEP_Schemes!L182","v":1},{"$f":"WINEP_Schemes!M182","v":"WWN"},{"$f":"WINEP_Schemes!N182","v":1},1.5840000000000001,1.5840000000000001,0,0,0,0,0,0]
[null,null,{"$f":"WINEP_Schemes!C183","v":"LNA00127"},{"$f":"WINEP_Schemes!D183","v":"7AW202023"},{"$f":"WINEP_Schemes!E183","v":"Dunholme STW"},{"$f":"WINEP_Schemes!F183","v":"£m"},{"$f":"WINEP_Schemes!G183","v":1},{"$f":"WINEP_Schemes!H183","v":0},{"$f":"WINEP_Schemes!J183","v":1},{"$f":"WINEP_Schemes!I183","v":3.25},{"$f":"WINEP_Schemes!K183","v":1},{"$f":"WINEP_Schemes!L183","v":1},{"$f":"WINEP_Schemes!M183","v":"WWN"},{"$f":"WINEP_Schemes!N183","v":1},3.25,3.25,0,0,0,0,0,0]
[null,null,{"$f":"WINEP_Schemes!C184","v":"LNA00128"},{"$f":"WINEP_Schemes!D184","v":"7AW202024"},{"$f":"WINEP_Schemes!E184","v":"Dunsby STW"},{"$f":"WINEP_Schemes!F184","v":"£m"},{"$f":"WINEP_Schemes!G184","v":1},{"$f":"WINEP_Schemes!H184","v":0},{"$f":"WINEP_Schemes!J184","v":1},{"$f":"WINEP_Schemes!I184","v":4.4740000000000002},{"$f":"WINEP_Schemes!K184","v":1},{"$f":"WINEP_Schemes!L184","v":1},{"$f":"WINEP_Schemes!M184","v":"WWN"},{"$f":"WINEP_Schemes!N184","v":1},4.4740000000000002,4.4740000000000002,0,0,0,0,0,0]
[null,null,{"$f":"WINEP_Schemes!C185","v":"LNA00130"},{"$f":"WINEP_Schemes!D185","v":"7AW202026"},{"$f":"WINEP_Schemes!E185","v":"Faldingworth STW"},{"$f":"WINEP_Schemes!F185","v":"£m"},{"$f":"WINEP_Schemes!G185","v":1},{"$f":"WINEP_Schemes!H185","v":0},{"$f":"WINEP_Schemes!J185","v":1},{"$f":"WINEP_Schemes!I185","v":1.581},{"$f":"WINEP_Schemes!K185","v":1},{"$f":"WINEP_Schemes!L185","v":1},{"$f":"WINEP_Schemes!M185","v":"WWN"},{"$f":"WINEP_Schemes!N185","v":1},1.581,1.581,0,0,0,0,0,0]
[null,null,{"$f":"WINEP_Schemes!C186","v":"LNA00135"},{"$f":"WINEP_Schemes!D186","v":"7AW202031"},{"$f":"WINEP_Schemes!E186","v":"Fulbeck STW"},{"$f":"WINEP_Schemes!F186","v":"£m"},{"$f":"WINEP_Schemes!G186","v":1},{"$f":"WINEP_Schemes!H186","v":0},{"$f":"WINEP_Schemes!J186","v":1},{"$f":"WINEP_Schemes!I186","v":3.4929999999999999},{"$f":"WINEP_Schemes!K186","v":1},{"$f":"WINEP_Schemes!L186","v":1},{"$f":"WINEP_Schemes!M186","v":"WWN"},{"$f":"WINEP_Schemes!N186","v":1},3.4929999999999999,3.4929999999999999,0,0,0,0,0,0]
[null,null,{"$f":"WINEP_Schemes!C187","v":"LNA00137"},{"$f":"WINEP_Schemes!D187","v":"7AW202033"},{"$f":"WINEP_Schemes!E187","v":"Glentworth STW"},{"$f":"WINEP_Schemes!F187","v":"£m"},{"$f":"WINEP_Schemes!G187","v":1},{"$f":"WINEP_Schemes!H187","v":0},{"$f":"WINEP_Schemes!J187","v":1},{"$f":"WINEP_Schemes!I187","v":0.157},{"$f":"WINEP_Schemes!K187","v":1},{"$f":"WINEP_Schemes!L187","v":1},{"$f":"WINEP_Schemes!M187","v":"WWN"},{"$f":"WINEP_Schemes!N187","v":1},0.157,0.157,0,0,0,0,0,0]
[null,null,{"$f":"WINEP_Schemes!C188","v":"LNA00138"},{"$f":"WINEP_Schemes!D188","v":"7AW202034"},{"$f":"WINEP_Schemes!E188","v":"Great Ponton STW"},{"$f":"WINEP_Schemes!F188","v":"£m"},{"$f":"WINEP_Schemes!G188","v":1},{"$f":"WINEP_Schemes!H188","v":0},{"$f":"WINEP_Schemes!J188","v":1},{"$f":"WINEP_Schemes!I188","v":0.159},{"$f":"WINEP_Schemes!K188","v":1},{"$f":"WINEP_Schemes!L188","v":1},{"$f":"WINEP_Schemes!M188","v":"WWN"},{"$f":"WINEP_Schemes!N188","v":1},0.159,0.159,0,0,0,0,0,0]
[null,null,{"$f":"WINEP_Schemes!C189","v":"LNA00140"},{"$f":"WINEP_Schemes!D189","v":"7AW202036"},{"$f":"WINEP_Schemes!E189","v":"Harlaxton STW"},{"$f":"WINEP_Schemes!F189","v":"£m"},{"$f":"WINEP_Schemes!G189","v":1},{"$f":"WINEP_Schemes!H189","v":0},{"$f":"WINEP_Schemes!J189","v":1},{"$f":"WINEP_Schemes!I189","v":1.976},{"$f":"WINEP_Schemes!K189","v":1},{"$f":"WINEP_Schemes!L189","v":1},{"$f":"WINEP_Schemes!M189","v":"WWN"},{"$f":"WINEP_Schemes!N189","v":1},1.976,1.976,0,0,0,0,0,0]
[null,null,{"$f":"WINEP_Schemes!C190","v":"LNA00143"},{"$f":"WINEP_Schemes!D190","v":"7AW202039"},{"$f":"WINEP_Schemes!E190","v":"Horbling STW"},{"$f":"WINEP_Schemes!F190","v":"£m"},{"$f":"WINEP_Schemes!G190","v":1},{"$f":"WINEP_Schemes!H190","v":0},{"$f":"WINEP_Schemes!J190","v":1},{"$f":"WINEP_Schemes!I190","v":3.75},{"$f":"WINEP_Schemes!K190","v":1},{"$f":"WINEP_Schemes!L190","v":1},{"$f":"WINEP_Schemes!M190","v":"WWN"},{"$f":"WINEP_Schemes!N190","v":1},3.75,3.75,0,0,0,0,0,0]
[null,null,{"$f":"WINEP_Schemes!C191","v":"LNA00144"},{"$f":"WINEP_Schemes!D191","v":"7AW202040"},{"$f":"WINEP_Schemes!E191","v":"Horncastle STW"},{"$f":"WINEP_Schemes!F191","v":"£m"},{"$f":"WINEP_Schemes!G191","v":1},{"$f":"WINEP_Schemes!H191","v":0},{"$f":"WINEP_Schemes!J191","v":1},{"$f":"WINEP_Schemes!I191","v":4.0199999999999996},{"$f":"WINEP_Schemes!K191","v":1},{"$f":"WINEP_Schemes!L191","v":1},{"$f":"WINEP_Schemes!M191","v":"WWN"},{"$f":"WINEP_Schemes!N191","v":1},4.0199999999999996,4.0199999999999996,0,0,0,0,0,0]
[null,null,{"$f":"WINEP_Schemes!C192","v":"LNA00149"},{"$f":"WINEP_Schemes!D192","v":"7AW202045"},{"$f":"WINEP_Schemes!E192","v":"Legbourne STW"},{"$f":"WINEP_Schemes!F192","v":"£m"},{"$f":"WINEP_Schemes!G192","v":1},{"$f":"WINEP_Schemes!H192","v":0},{"$f":"WINEP_Schemes!J192","v":1},{"$f":"WINEP_Schemes!I192","v":1.6910000000000001},{"$f":"WINEP_Schemes!K192","v":1},{"$f":"WINEP_Schemes!L192","v":1},{"$f":"WINEP_Schemes!M192","v":"WWN"},{"$f":"WINEP_Schemes!N192","v":1},1.6910000000000001,1.6910000000000001,0,0,0,0,0,0]
[null,null,{"$f":"WINEP_Schemes!C193","v":"LNA00152"},{"$f":"WINEP_Schemes!D193","v":"7AW202048"},{"$f":"WINEP_Schemes!E193","v":"Mablethorpe STW"},{"$f":"WINEP_Schemes!F193","v":0},{"$f":"WINEP_Schemes!G193","v":0},{"$f":"WINEP_Schemes!H193","v":0},{"$f":"WINEP_Schemes!J193","v":0},{"$f":"WINEP_Schemes!I193","v":0},{"$f":"WINEP_Schemes!K193","v":0},{"$f":"WINEP_Schemes!L193","v":0},{"$f":"WINEP_Schemes!M193","v":0},{"$f":"WINEP_Schemes!N193","v":0},0,0,0,0,0,0,0,0]
[null,null,{"$f":"WINEP_Schemes!C194","v":"LNA00153"},{"$f":"WINEP_Schemes!D194","v":"7AW202049"},{"$f":"WINEP_Schemes!E194","v":"Manby STW"},{"$f":"WINEP_Schemes!F194","v":"£m"},{"$f":"WINEP_Schemes!G194","v":1},{"$f":"WINEP_Schemes!H194","v":0},{"$f":"WINEP_Schemes!J194","v":1},{"$f":"WINEP_Schemes!I194","v":2.9990000000000001},{"$f":"WINEP_Schemes!K194","v":1},{"$f":"WINEP_Schemes!L194","v":1},{"$f":"WINEP_Schemes!M194","v":"WWN"},{"$f":"WINEP_Schemes!N194","v":1},2.9990000000000001,2.9990000000000001,0,0,0,0,0,0]
[null,null,{"$f":"WINEP_Schemes!C195","v":"LNA00159"},{"$f":"WINEP_Schemes!D195","v":"7AW202055"},{"$f":"WINEP_Schemes!E195","v":"Navenby STW"},{"$f":"WINEP_Schemes!F195","v":"£m"},{"$f":"WINEP_Schemes!G195","v":1},{"$f":"WINEP_Schemes!H195","v":0},{"$f":"WINEP_Schemes!J195","v":1},{"$f":"WINEP_Schemes!I195","v":0.09},{"$f":"WINEP_Schemes!K195","v":1},{"$f":"WINEP_Schemes!L195","v":1},{"$f":"WINEP_Schemes!M195","v":"WWN"},{"$f":"WINEP_Schemes!N195","v":1},0.09,0.09,0,0,0,0,0,0]
[null,null,{"$f":"WINEP_Schemes!C196","v":"LNA00160"},{"$f":"WINEP_Schemes!D196","v":"7AW202056"},{"$f":"WINEP_Schemes!E196","v":"Nettleham STW"},{"$f":"WINEP_Schemes!F196","v":"£m"},{"$f":"WINEP_Schemes!G196","v":1},{"$f":"WINEP_Schemes!H196","v":0},{"$f":"WINEP_Schemes!J196","v":1},{"$f":"WINEP_Schemes!I196","v":3.048},{"$f":"WINEP_Schemes!K196","v":1},{"$f":"WINEP_Schemes!L196","v":1},{"$f":"WINEP_Schemes!M196","v":"WWN"},{"$f":"WINEP_Schemes!N196","v":1},3.048,3.048,0,0,0,0,0,0]
[null,null,{"$f":"WINEP_Schemes!C197","v":"LNA00165"},{"$f":"WINEP_Schemes!D197","v":"7AW202061"},{"$f":"WINEP_Schemes!E197","v":"Osbournby STW"},{"$f":"WINEP_Schemes!F197","v":"£m"},{"$f":"WINEP_Schemes!G197","v":1},{"$f":"WINEP_Schemes!H197","v":0},{"$f":"WINEP_Schemes!J197","v":1},{"$f":"WINEP_Schemes!I197","v":1.85},{"$f":"WINEP_Schemes!K197","v":1},{"$f":"WINEP_Schemes!L197","v":1},{"$f":"WINEP_Schemes!M197","v":"WWN"},{"$f":"WINEP_Schemes!N197","v":1},1.85,1.85,0,0,0,0,0,0]
[null,null,{"$f":"WINEP_Schemes!C198","v":"LNA00167"},{"$f":"WINEP_Schemes!D198","v":"7AW202063"},{"$f":"WINEP_Schemes!E198","v":"Reepham (Lincs) STW"},{"$f":"WINEP_Schemes!F198","v":"£m"},{"$f":"WINEP_Schemes!G198","v":1},{"$f":"WINEP_Schemes!H198","v":0},{"$f":"WINEP_Schemes!J198","v":1},{"$f":"WINEP_Schemes!I198","v":4.2850000000000001},{"$f":"WINEP_Schemes!K198","v":1},{"$f":"WINEP_Schemes!L198","v":1},{"$f":"WINEP_Schemes!M198","v":"WWN"},{"$f":"WINEP_Schemes!N198","v":1},4.2850000000000001,4.2850000000000001,0,0,0,0,0,0]
[null,null,{"$f":"WINEP_Schemes!C199","v":"LNA00172"},{"$f":"WINEP_Schemes!D199","v":"7AW202068"},{"$f":"WINEP_Schemes!E199","v":"Silk Willoughby STW"},{"$f":"WINEP_Schemes!F199","v":"£m"},{"$f":"WINEP_Schemes!G199","v":1},{"$f":"WINEP_Schemes!H199","v":0},{"$f":"WINEP_Schemes!J199","v":1},{"$f":"WINEP_Schemes!I199","v":1.5780000000000001},{"$f":"WINEP_Schemes!K199","v":1},{"$f":"WINEP_Schemes!L199","v":1},{"$f":"WINEP_Schemes!M199","v":"WWN"},{"$f":"WINEP_Schemes!N199","v":1},1.5780000000000001,1.5780000000000001,0,0,0,0,0,0]
[null,null,{"$f":"WINEP_Schemes!C200","v":"LNA00178"},{"$f":"WINEP_Schemes!D200","v":"7AW202074"},{"$f":"WINEP_Schemes!E200","v":"South Witham STW"},{"$f":"WINEP_Schemes!F200","v":"£m"},{"$f":"WINEP_Schemes!G200","v":1},{"$f":"WINEP_Schemes!H200","v":0},{"$f":"WINEP_Schemes!J200","v":1},{"$f":"WINEP_Schemes!I200","v":3.3940000000000001},{"$f":"WINEP_Schemes!K200","v":1},{"$f":"WINEP_Schemes!L200","v":1},{"$f":"WINEP_Schemes!M200","v":"WWN"},{"$f":"WINEP_Schemes!N200","v":1},3.3940000000000001,3.3940000000000001,0,0,0,0,0,0]
[null,null,{"$f":"WINEP_Schemes!C201","v":"LNA00182"},{"$f":"WINEP_Schemes!D201","v":"7AW202078"},{"$f":"WINEP_Schemes!E201","v":"Strubby STW"},{"$f":"WINEP_Schemes!F201","v":"£m"},{"$f":"WINEP_Schemes!G201","v":1},{"$f":"WINEP_Schemes!H201","v":0},{"$f":"WINEP_Schemes!J201","v":1},{"$f":"WINEP_Schemes!I201","v":2.4380000000000002},{"$f":"WINEP_Schemes!K201","v":1},{"$f":"WINEP_Schemes!L201","v":1},{"$f":"WINEP_Schemes!M201","v":"WWN"},{"$f":"WINEP_Schemes!N201","v":1},2.4380000000000002,2.4380000000000002,0,0,0,0,0,0]
[null,null,{"$f":"WINEP_Schemes!C202","v":"LNA00189"},{"$f":"WINEP_Schemes!D202","v":"7AW202085"},{"$f":"WINEP_Schemes!E202","v":"Toynton St Peter STW"},{"$f":"WINEP_Schemes!F202","v":"£m"},{"$f":"WINEP_Schemes!G202","v":1},{"$f":"WINEP_Schemes!H202","v":0},{"$f":"WINEP_Schemes!J202","v":1},{"$f":"WINEP_Schemes!I202","v":1.5780000000000001},{"$f":"WINEP_Schemes!K202","v":1},{"$f":"WINEP_Schemes!L202","v":1},{"$f":"WINEP_Schemes!M202","v":"WWN"},{"$f":"WINEP_Schemes!N202","v":1},1.5780000000000001,1.5780000000000001,0,0,0,0,0,0]
[null,null,{"$f":"WINEP_Schemes!C203","v":"LNA00190"},{"$f":"WINEP_Schemes!D203","v":"7AW202086"},{"$f":"WINEP_Schemes!E203","v":"Upton STW"},{"$f":"WINEP_Schemes!F203","v":"£m"},{"$f":"WINEP_Schemes!G203","v":1},{"$f":"WINEP_Schemes!H203","v":0},{"$f":"WINEP_Schemes!J203","v":1},{"$f":"WINEP_Schemes!I203","v":0.22500000000000001},{"$f":"WINEP_Schemes!K203","v":1},{"$f":"WINEP_Schemes!L203","v":1},{"$f":"WINEP_Schemes!M203","v":"WWN"},{"$f":"WINEP_Schemes!N203","v":1},0.22500000000000001,0.22500000000000001,0,0,0,0,0,0]
[null,null,{"$f":"WINEP_Schemes!C204","v":"LNA00193"},{"$f":"WINEP_Schemes!D204","v":"7AW202089"},{"$f":"WINEP_Schemes!E204","v":"Willingham (Lincs) STW"},{"$f":"WINEP_Schemes!F204","v":"£m"},{"$f":"WINEP_Schemes!G204","v":1},{"$f":"WINEP_Schemes!H204","v":0},{"$f":"WINEP_Schemes!J204","v":1},{"$f":"WINEP_Schemes!I204","v":0.52100000000000002},{"$f":"WINEP_Schemes!K204","v":1},{"$f":"WINEP_Schemes!L204","v":1},{"$f":"WINEP_Schemes!M204","v":"WWN"},{"$f":"WINEP_Schemes!N204","v":1},0.52100000000000002,0.52100000000000002,0,0,0,0,0,0]
[null,null,{"$f":"WINEP_Schemes!C205","v":"LNA00195"},{"$f":"WINEP_Schemes!D205","v":"7AW202091"},{"$f":"WINEP_Schemes!E205","v":"Wragby STW"},{"$f":"WINEP_Schemes!F205","v":"£m"},{"$f":"WINEP_Schemes!G205","v":1},{"$f":"WINEP_Schemes!H205","v":0},{"$f":"WINEP_Schemes!J205","v":1},{"$f":"WINEP_Schemes!I205","v":3.3380000000000001},{"$f":"WINEP_Schemes!K205","v":1},{"$f":"WINEP_Schemes!L205","v":1},{"$f":"WINEP_Schemes!M205","v":"WWN"},{"$f":"WINEP_Schemes!N205","v":1},3.3380000000000001,3.3380000000000001,0,0,0,0,0,0]
[null,null,{"$f":"WINEP_Schemes!C206","v":"LNA00207"},{"$f":"WINEP_Schemes!D206","v":"7AW202103"},{"$f":"WINEP_Schemes!E206","v":"Gosberton STW"},{"$f":"WINEP_Schemes!F206","v":"£m"},{"$f":"WINEP_Schemes!G206","v":1},{"$f":"WINEP_Schemes!H206","v":0},{"$f":"WINEP_Schemes!J206","v":1},{"$f":"WINEP_Schemes!I206","v":2.2909999999999999},{"$f":"WINEP_Schemes!K206","v":1},{"$f":"WINEP_Schemes!L206","v":1},{"$f":"WINEP_Schemes!M206","v":"WWN"},{"$f":"WINEP_Schemes!N206","v":1},2.2909999999999999,2.2909999999999999,0,0,0,0,0,0]
[null,null,{"$f":"WINEP_Schemes!C207","v":"LNA00211"},{"$f":"WINEP_Schemes!D207","v":"7AW202107"},{"$f":"WINEP_Schemes!E207","v":"Holbeach STW"},{"$f":"WINEP_Schemes!F207","v":0},{"$f":"WINEP_Schemes!G207","v":0},{"$f":"WINEP_Schemes!H207","v":0},{"$f":"WINEP_Schemes!J207","v":0},{"$f":"WINEP_Schemes!I207","v":0},{"$f":"WINEP_Schemes!K207","v":0},{"$f":"WINEP_Schemes!L207","v":0},{"$f":"WINEP_Schemes!M207","v":0},{"$f":"WINEP_Schemes!N207","v":0},0,0,0,0,0,0,0,0]
[null,null,{"$f":"WINEP_Schemes!C208","v":"LNA00215"},{"$f":"WINEP_Schemes!D208","v":"7AW202111"},{"$f":"WINEP_Schemes!E208","v":"Kibworth STW"},{"$f":"WINEP_Schemes!F208","v":0},{"$f":"WINEP_Schemes!G208","v":0},{"$f":"WINEP_Schemes!H208","v":0},{"$f":"WINEP_Schemes!J208","v":0},{"$f":"WINEP_Schemes!I208","v":0},{"$f":"WINEP_Schemes!K208","v":0},{"$f":"WINEP_Schemes!L208","v":0},{"$f":"WINEP_Schemes!M208","v":0},{"$f":"WINEP_Schemes!N208","v":0},{"$f":" I209 * J209 * G209","v":0},{"$f":" N209 * O209","v":0},{"$f":" IF(L209 = 0, P209, (N209 - 1) * O209)","v":0},0,0,0,0,0]
[null,null,{"$f":"WINEP_Schemes!C209","v":"LNA00217"},{"$f":"WINEP_Schemes!D209","v":"7AW202113"},{"$f":"WINEP_Schemes!E209","v":"Little Bytham STW"},{"$f":"WINEP_Schemes!F209","v":"£m"},{"$f":"WINEP_Schemes!G209","v":1},{"$f":"WINEP_Schemes!H209","v":0},{"$f":"WINEP_Schemes!J209","v":1},{"$f":"WINEP_Schemes!I209","v":2.8809999999999998},{"$f":"WINEP_Schemes!K209","v":1},{"$f":"WINEP_Schemes!L209","v":1},{"$f":"WINEP_Schemes!M209","v":"WWN"},{"$f":"WINEP_Schemes!N209","v":1},2.8809999999999998,2.8809999999999998,0,0,0,0,0,0]
[null,null,{"$f":"WINEP_Schemes!C210","v":"LNA00219"},{"$f":"WINEP_Schemes!D210","v":"7AW202115"},{"$f":"WINEP_Schemes!E210","v":"Market Harborough STW"},{"$f":"WINEP_Schemes!F210","v":0},{"$f":"WINEP_Schemes!G210","v":0},{"$f":"WINEP_Schemes!H210","v":0},{"$f":"WINEP_Schemes!J210","v":0},{"$f":"WINEP_Schemes!I210","v":0},{"$f":"WINEP_Schemes!K210","v":0},{"$f":"WINEP_Schemes!L210","v":0},{"$f":"WINEP_Schemes!M210","v":0},{"$f":"WINEP_Schemes!N210","v":0},0,0,0,0,0,0,0,0]
[null,null,{"$f":"WINEP_Schemes!C211","v":"LNA00229"},{"$f":"WINEP_Schemes!D211","v":"7AW202125"},{"$f":"WINEP_Schemes!E211","v":"Sibbertoft STW"},{"$f":"WINEP_Schemes!F211","v":"£m"},{"$f":"WINEP_Schemes!G211","v":1},{"$f":"WINEP_Schemes!H211","v":0},{"$f":"WINEP_Schemes!J211","v":1},{"$f":"WINEP_Schemes!I211","v":2.9140000000000001},{"$f":"WINEP_Schemes!K211","v":1},{"$f":"WINEP_Schemes!L211","v":1},{"$f":"WINEP_Schemes!M211","v":"WWN"},{"$f":"WINEP_Schemes!N211","v":1},2.9140000000000001,2.9140000000000001,0,0,0,0,0,0]
[null,null,{"$f":"WINEP_Schemes!C212","v":"LNA00239"},{"$f":"WINEP_Schemes!D212","v":"7AW202135"},{"$f":"WINEP_Schemes!E212","v":"Wing STW"},{"$f":"WINEP_Schemes!F212","v":"£m"},{"$f":"WINEP_Schemes!G212","v":1},{"$f":"WINEP_Schemes!H212","v":0},{"$f":"WINEP_Schemes!J212","v":1},{"$f":"WINEP_Schemes!I212","v":1.248},{"$f":"WINEP_Schemes!K212","v":1},{"$f":"WINEP_Schemes!L212","v":1},{"$f":"WINEP_Schemes!M212","v":"WWN"},{"$f":"WINEP_Schemes!N212","v":1},1.248,1.248,0,0,0,0,0,0]
[null,null,{"$f":"WINEP_Schemes!C213","v":"LNA00243"},{"$f":"WINEP_Schemes!D213","v":"7AW202139"},{"$f":"WINEP_Schemes!E213","v":"Caistor STW"},{"$f":"WINEP_Schemes!F213","v":"£m"},{"$f":"WINEP_Schemes!G213","v":1},{"$f":"WINEP_Schemes!H213","v":0},{"$f":"WINEP_Schemes!J213","v":1},{"$f":"WINEP_Schemes!I213","v":3.1429999999999998},{"$f":"WINEP_Schemes!K213","v":1},{"$f":"WINEP_Schemes!L213","v":1},{"$f":"WINEP_Schemes!M213","v":"WWN"},{"$f":"WINEP_Schemes!N213","v":1},3.1429999999999998,3.1429999999999998,0,0,0,0,0,0]
[null,null,{"$f":"WINEP_Schemes!C214","v":"LNA00244"},{"$f":"WINEP_Schemes!D214","v":"7AW202140"},{"$f":"WINEP_Schemes!E214","v":"Faldingworth (Ex MOD) STW"},{"$f":"WINEP_Schemes!F214","v":"£m"},{"$f":"WINEP_Schemes!G214","v":1},{"$f":"WINEP_Schemes!H214","v":0},{"$f":"WINEP_Schemes!J214","v":1},{"$f":"WINEP_Schemes!I214","v":1.583},{"$f":"WINEP_Schemes!K214","v":1},{"$f":"WINEP_Schemes!L214","v":1},{"$f":"WINEP_Schemes!M214","v":"WWN"},{"$f":"WINEP_Schemes!N214","v":1},1.583,1.583,0,0,0,0,0,0]
[null,null,{"$f":"WINEP_Schemes!C215","v":"LNA00245"},{"$f":"WINEP_Schemes!D215","v":"7AW202141"},{"$f":"WINEP_Schemes!E215","v":"Glentham STW"},{"$f":"WINEP_Schemes!F215","v":"£m"},{"$f":"WINEP_Schemes!G215","v":1},{"$f":"WINEP_Schemes!H215","v":0},{"$f":"WINEP_Schemes!J215","v":1},{"$f":"WINEP_Schemes!I215","v":0.65100000000000002},{"$f":"WINEP_Schemes!K215","v":1},{"$f":"WINEP_Schemes!L215","v":1},{"$f":"WINEP_Schemes!M215","v":"WWN"},{"$f":"WINEP_Schemes!N215","v":1},0.65100000000000002,0.65100000000000002,0,0,0,0,0,0]
[null,null,{"$f":"WINEP_Schemes!C216","v":"LNA00249"},{"$f":"WINEP_Schemes!D216","v":"7AW202145"},{"$f":"WINEP_Schemes!E216","v":"Laceby STW"},{"$f":"WINEP_Schemes!F216","v":"£m"},{"$f":"WINEP_Schemes!G216","v":1},{"$f":"WINEP_Schemes!H216","v":0},{"$f":"WINEP_Schemes!J216","v":1},{"$f":"WINEP_Schemes!I216","v":3.1230000000000002},{"$f":"WINEP_Schemes!K216","v":1},{"$f":"WINEP_Schemes!L216","v":1},{"$f":"WINEP_Schemes!M216","v":"WWN"},{"$f":"WINEP_Schemes!N216","v":1},3.1230000000000002,3.1230000000000002,0,0,0,0,0,0]
[null,null,{"$f":"WINEP_Schemes!C217","v":"LNA00250"},{"$f":"WINEP_Schemes!D217","v":"7AW202146"},{"$f":"WINEP_Schemes!E217","v":"Louth STW"},{"$f":"WINEP_Schemes!F217","v":"£m"},{"$f":"WINEP_Schemes!G217","v":1},{"$f":"WINEP_Schemes!H217","v":0},{"$f":"WINEP_Schemes!J217","v":1},{"$f":"WINEP_Schemes!I217","v":6.34},{"$f":"WINEP_Schemes!K217","v":1},{"$f":"WINEP_Schemes!L217","v":1},{"$f":"WINEP_Schemes!M217","v":"WWN"},{"$f":"WINEP_Schemes!N217","v":1},6.34,6.34,0,0,0,0,0,0]
[null,null,{"$f":"WINEP_Schemes!C218","v":"LNA00251"},{"$f":"WINEP_Schemes!D218","v":"7AW202147"},{"$f":"WINEP_Schemes!E218","v":"Market Rasen STW"},{"$f":"WINEP_Schemes!F218","v":"£m"},{"$f":"WINEP_Schemes!G218","v":1},{"$f":"WINEP_Schemes!H218","v":0},{"$f":"WINEP_Schemes!J218","v":1},{"$f":"WINEP_Schemes!I218","v":2.2330000000000001},{"$f":"WINEP_Schemes!K218","v":1},{"$f":"WINEP_Schemes!L218","v":1},{"$f":"WINEP_Schemes!M218","v":"WWN"},{"$f":"WINEP_Schemes!N218","v":1},2.2330000000000001,2.2330000000000001,0,0,0,0,0,0]
[null,null,{"$f":"WINEP_Schemes!C219","v":"LNA00254"},{"$f":"WINEP_Schemes!D219","v":"7AW202150"},{"$f":"WINEP_Schemes!E219","v":"Owmby STW"},{"$f":"WINEP_Schemes!F219","v":"£m"},{"$f":"WINEP_Schemes!G219","v":1},{"$f":"WINEP_Schemes!H219","v":0},{"$f":"WINEP_Schemes!J219","v":1},{"$f":"WINEP_Schemes!I219","v":0.22500000000000001},{"$f":"WINEP_Schemes!K219","v":1},{"$f":"WINEP_Schemes!L219","v":1},{"$f":"WINEP_Schemes!M219","v":"WWN"},{"$f":"WINEP_Schemes!N219","v":1},0.22500000000000001,0.22500000000000001,0,0,0,0,0,0]
[null,null,{"$f":"WINEP_Schemes!C220","v":"LNA00255"},{"$f":"WINEP_Schemes!D220","v":"7AW202151"},{"$f":"WINEP_Schemes!E220","v":"Tealby STW"},{"$f":"WINEP_Schemes!F220","v":"£m"},{"$f":"WINEP_Schemes!G220","v":1},{"$f":"WINEP_Schemes!H220","v":0},{"$f":"WINEP_Schemes!J220","v":1},{"$f":"WINEP_Schemes!I220","v":1.347},{"$f":"WINEP_Schemes!K220","v":1},{"$f":"WINEP_Schemes!L220","v":1},{"$f":"WINEP_Schemes!M220","v":"WWN"},{"$f":"WINEP_Schemes!N220","v":1},1.347,1.347,0,0,0,0,0,0]
[null,null,{"$f":"WINEP_Schemes!C221","v":"LNA00256"},{"$f":"WINEP_Schemes!D221","v":"7AW202152"},{"$f":"WINEP_Schemes!E221","v":"Ulceby STW"},{"$f":"WINEP_Schemes!F221","v":"£m"},{"$f":"WINEP_Schemes!G221","v":1},{"$f":"WINEP_Schemes!H221","v":0},{"$f":"WINEP_Schemes!J221","v":1},{"$f":"WINEP_Schemes!I221","v":2.9460000000000002},{"$f":"WINEP_Schemes!K221","v":1},{"$f":"WINEP_Schemes!L221","v":1},{"$f":"WINEP_Schemes!M221","v":"WWN"},{"$f":"WINEP_Schemes!N221","v":1},2.9460000000000002,2.9460000000000002,0,0,0,0,0,0]
[null,null,{"$f":"WINEP_Schemes!C222","v":"LNA00263"},{"$f":"WINEP_Schemes!D222","v":"7AW202159"},{"$f":"WINEP_Schemes!E222","v":"Corby Glen STW"},{"$f":"WINEP_Schemes!F222","v":"£m"},{"$f":"WINEP_Schemes!G222","v":1},{"$f":"WINEP_Schemes!H222","v":0},{"$f":"WINEP_Schemes!J222","v":1},{"$f":"WINEP_Schemes!I222","v":1.8440000000000001},{"$f":"WINEP_Schemes!K222","v":1},{"$f":"WINEP_Schemes!L222","v":1},{"$f":"WINEP_Schemes!M222","v":"WWN"},{"$f":"WINEP_Schemes!N222","v":1},1.8440000000000001,1.8440000000000001,0,0,0,0,0,0]
[null,null,{"$f":"WINEP_Schemes!C223","v":"LNA00273"},{"$f":"WINEP_Schemes!D223","v":"7AW202169"},{"$f":"WINEP_Schemes!E223","v":"DrWPA - Aswarby"},{"$f":"WINEP_Schemes!F223","v":"£m"},{"$f":"WINEP_Schemes!G223","v":1},{"$f":"WINEP_Schemes!H223","v":0},{"$f":"WINEP_Schemes!J223","v":1},{"$f":"WINEP_Schemes!I223","v":3.1E-2},{"$f":"WINEP_Schemes!K223","v":1},{"$f":"WINEP_Schemes!L223","v":1},{"$f":"WINEP_Schemes!M223","v":"WWN"},{"$f":"WINEP_Schemes!N223","v":1},3.1E-2,3.1E-2,0,0,0,0,0,0]
[null,null,{"$f":"WINEP_Schemes!C224","v":"LNA00274"},{"$f":"WINEP_Schemes!D224","v":"7AW202170"},{"$f":"WINEP_Schemes!E224","v":"DrWPA - Barnoldby"},{"$f":"WINEP_Schemes!F224","v":"£m"},{"$f":"WINEP_Schemes!G224","v":1},{"$f":"WINEP_Schemes!H224","v":0},{"$f":"WINEP_Schemes!J224","v":1},{"$f":"WINEP_Schemes!I224","v":3.1E-2},{"$f":"WINEP_Schemes!K224","v":1},{"$f":"WINEP_Schemes!L224","v":1},{"$f":"WINEP_Schemes!M224","v":"WWN"},{"$f":"WINEP_Schemes!N224","v":1},3.1E-2,3.1E-2,0,0,0,0,0,0]
[null,null,{"$f":"WINEP_Schemes!C225","v":"LNA00275"},{"$f":"WINEP_Schemes!D225","v":"7AW202171"},{"$f":"WINEP_Schemes!E225","v":"DrWPA - Barrow"},{"$f":"WINEP_Schemes!F225","v":"£m"},{"$f":"WINEP_Schemes!G225","v":1},{"$f":"WINEP_Schemes!H225","v":0},{"$f":"WINEP_Schemes!J225","v":1},{"$f":"WINEP_Schemes!I225","v":3.1E-2},{"$f":"WINEP_Schemes!K225","v":1},{"$f":"WINEP_Schemes!L225","v":1},{"$f":"WINEP_Schemes!M225","v":"WWN"},{"$f":"WINEP_Schemes!N225","v":1},3.1E-2,3.1E-2,0,0,0,0,0,0]
[null,null,{"$f":"WINEP_Schemes!C226","v":"LNA00276"},{"$f":"WINEP_Schemes!D226","v":"7AW202172"},{"$f":"WINEP_Schemes!E226","v":"DrWPA - Barton"},{"$f":"WINEP_Schemes!F226","v":"£m"},{"$f":"WINEP_Schemes!G226","v":1},{"$f":"WINEP_Schemes!H226","v":0},{"$f":"WINEP_Schemes!J226","v":1},{"$f":"WINEP_Schemes!I226","v":3.1E-2},{"$f":"WINEP_Schemes!K226","v":1},{"$f":"WINEP_Schemes!L226","v":1},{"$f":"WINEP_Schemes!M226","v":"WWN"},{"$f":"WINEP_Schemes!N226","v":1},3.1E-2,3.1E-2,0,0,0,0,0,0]
[null,null,{"$f":"WINEP_Schemes!C227","v":"LNA00277"},{"$f":"WINEP_Schemes!D227","v":"7AW202173"},{"$f":"WINEP_Schemes!E227","v":"DrWPA - Drove Lane"},{"$f":"WINEP_Schemes!F227","v":"£m"},{"$f":"WINEP_Schemes!G227","v":1},{"$f":"WINEP_Schemes!H227","v":0},{"$f":"WINEP_Schemes!J227","v":1},{"$f":"WINEP_Schemes!I227","v":3.1E-2},{"$f":"WINEP_Schemes!K227","v":1},{"$f":"WINEP_Schemes!L227","v":1},{"$f":"WINEP_Schemes!M227","v":"WWN"},{"$f":"WINEP_Schemes!N227","v":1},3.1E-2,3.1E-2,0,0,0,0,0,0]
[null,null,{"$f":"WINEP_Schemes!C228","v":"LNA00278"},{"$f":"WINEP_Schemes!D228","v":"7AW202174"},{"$f":"WINEP_Schemes!E228","v":"DrWPA - Dunston"},{"$f":"WINEP_Schemes!F228","v":"£m"},{"$f":"WINEP_Schemes!G228","v":1},{"$f":"WINEP_Schemes!H228","v":0},{"$f":"WINEP_Schemes!J228","v":1},{"$f":"WINEP_Schemes!I228","v":3.1E-2},{"$f":"WINEP_Schemes!K228","v":1},{"$f":"WINEP_Schemes!L228","v":1},{"$f":"WINEP_Schemes!M228","v":"WWN"},{"$f":"WINEP_Schemes!N228","v":1},3.1E-2,3.1E-2,0,0,0,0,0,0]
[null,null,{"$f":"WINEP_Schemes!C229","v":"LNA00279"},{"$f":"WINEP_Schemes!D229","v":"7AW202175"},{"$f":"WINEP_Schemes!E229","v":"Etton"},{"$f":"WINEP_Schemes!F229","v":"£m"},{"$f":"WINEP_Schemes!G229","v":1},{"$f":"WINEP_Schemes!H229","v":0},{"$f":"WINEP_Schemes!J229","v":1},{"$f":"WINEP_Schemes!I229","v":4.2480000000000002},{"$f":"WINEP_Schemes!K229","v":1},{"$f":"WINEP_Schemes!L229","v":1},{"$f":"WINEP_Schemes!M229","v":"WWN"},{"$f":"WINEP_Schemes!N229","v":1},4.2480000000000002,4.2480000000000002,0,0,0,0,0,0]
[null,null,{"$f":"WINEP_Schemes!C230","v":"LNA00280"},{"$f":"WINEP_Schemes!D230","v":"7AW202176"},{"$f":"WINEP_Schemes!E230","v":"DrWPA - Goxhill 2"},{"$f":"WINEP_Schemes!F230","v":"£m"},{"$f":"WINEP_Schemes!G230","v":1},{"$f":"WINEP_Schemes!H230","v":0},{"$f":"WINEP_Schemes!J230","v":1},{"$f":"WINEP_Schemes!I230","v":3.1E-2},{"$f":"WINEP_Schemes!K230","v":1},{"$f":"WINEP_Schemes!L230","v":1},{"$f":"WINEP_Schemes!M230","v":"WWN"},{"$f":"WINEP_Schemes!N230","v":1},3.1E-2,3.1E-2,0,0,0,0,0,0]
[null,null,{"$f":"WINEP_Schemes!C231","v":"LNA00281"},{"$f":"WINEP_Schemes!D231","v":"7AW202177"},{"$f":"WINEP_Schemes!E231","v":"DrWPA - Habrough"},{"$f":"WINEP_Schemes!F231","v":"£m"},{"$f":"WINEP_Schemes!G231","v":1},{"$f":"WINEP_Schemes!H231","v":0},{"$f":"WINEP_Schemes!J231","v":1},{"$f":"WINEP_Schemes!I231","v":3.1E-2},{"$f":"WINEP_Schemes!K231","v":1},{"$f":"WINEP_Schemes!L231","v":1},{"$f":"WINEP_Schemes!M231","v":"WWN"},{"$f":"WINEP_Schemes!N231","v":1},3.1E-2,3.1E-2,0,{"$f":" IF($M232 = R$9, $Q232, 0)","v":0},0,0,0,0]
[null,null,{"$f":"WINEP_Schemes!C232","v":"LNA00282"},{"$f":"WINEP_Schemes!D232","v":"7AW202178"},{"$f":"WINEP_Schemes!E232","v":"DrWPA - Healing"},{"$f":"WINEP_Schemes!F232","v":"£m"},{"$f":"WINEP_Schemes!G232","v":1},{"$f":"WINEP_Schemes!H232","v":0},{"$f":"WINEP_Schemes!J232","v":1},{"$f":"WINEP_Schemes!I232","v":3.1E-2},{"$f":"WINEP_Schemes!K232","v":1},{"$f":"WINEP_Schemes!L232","v":1},{"$f":"WINEP_Schemes!M232","v":"WWN"},{"$f":"WINEP_Schemes!N232","v":1},3.1E-2,3.1E-2,0,0,0,0,0,0]
[null,null,{"$f":"WINEP_Schemes!C233","v":"LNA00283"},{"$f":"WINEP_Schemes!D233","v":"7AW202179"},{"$f":"WINEP_Schemes!E233","v":"DrWPA - Little London"},{"$f":"WINEP_Schemes!F233","v":"£m"},{"$f":"WINEP_Schemes!G233","v":1},{"$f":"WINEP_Schemes!H233","v":0},{"$f":"WINEP_Schemes!J233","v":1},{"$f":"WINEP_Schemes!I233","v":3.1E-2},{"$f":"WINEP_Schemes!K233","v":1},{"$f":"WINEP_Schemes!L233","v":1},{"$f":"WINEP_Schemes!M233","v":"WWN"},{"$f":"WINEP_Schemes!N233","v":1},3.1E-2,3.1E-2,0,0,0,0,0,0]
[null,null,{"$f":"WINEP_Schemes!C234","v":"LNA00284"},{"$f":"WINEP_Schemes!D234","v":"7AW202180"},{"$f":"WINEP_Schemes!E234","v":"DrWPA - Littlecoates"},{"$f":"WINEP_Schemes!F234","v":"£m"},{"$f":"WINEP_Schemes!G234","v":1},{"$f":"WINEP_Schemes!H234","v":0},{"$f":"WINEP_Schemes!J234","v":1},{"$f":"WINEP_Schemes!I234","v":3.1E-2},{"$f":"WINEP_Schemes!K234","v":1},{"$f":"WINEP_Schemes!L234","v":1},{"$f":"WINEP_Schemes!M234","v":"WWN"},{"$f":"WINEP_Schemes!N234","v":1},3.1E-2,3.1E-2,0,0,0,0,0,0]
[null,null,{"$f":"WINEP_Schemes!C235","v":"LNA00285"},{"$f":"WINEP_Schemes!D235","v":"7AW202181"},{"$f":"WINEP_Schemes!E235","v":"DrWPA - Thornton Curtis"},{"$f":"WINEP_Schemes!F235","v":"£m"},{"$f":"WINEP_Schemes!G235","v":1},{"$f":"WINEP_Schemes!H235","v":0},{"$f":"WINEP_Schemes!J235","v":1},{"$f":"WINEP_Schemes!I235","v":3.1E-2},{"$f":"WINEP_Schemes!K235","v":1},{"$f":"WINEP_Schemes!L235","v":1},{"$f":"WINEP_Schemes!M235","v":"WWN"},{"$f":"WINEP_Schemes!N235","v":1},3.1E-2,3.1E-2,0,0,0,0,0,0]
[null,null,{"$f":"WINEP_Schemes!C236","v":"LNA00286"},{"$f":"WINEP_Schemes!D236","v":"7AW202182"},{"$f":"WINEP_Schemes!E236","v":"DrWPA - Ulceby"},{"$f":"WINEP_Schemes!F236","v":"£m"},{"$f":"WINEP_Schemes!G236","v":1},{"$f":"WINEP_Schemes!H236","v":0},{"$f":"WINEP_Schemes!J236","v":1},{"$f":"WINEP_Schemes!I236","v":3.1E-2},{"$f":"WINEP_Schemes!K236","v":1},{"$f":"WINEP_Schemes!L236","v":1},{"$f":"WINEP_Schemes!M236","v":"WWN"},{"$f":"WINEP_Schemes!N236","v":1},3.1E-2,3.1E-2,0,0,0,0,0,0]
[null,null,{"$f":"WINEP_Schemes!C237","v":"EAN00422"},{"$f":"WINEP_Schemes!D237","v":"7AW202261"},{"$f":"WINEP_Schemes!E237","v":"DrWPA - Trowse Newton"},{"$f":"WINEP_Schemes!F237","v":"£m"},{"$f":"WINEP_Schemes!G237","v":1},{"$f":"WINEP_Schemes!H237","v":0},{"$f":"WINEP_Schemes!J237","v":1},{"$f":"WINEP_Schemes!I237","v":3.1E-2},{"$f":"WINEP_Schemes!K237","v":1},{"$f":"WINEP_Schemes!L237","v":1},{"$f":"WINEP_Schemes!M237","v":"WWN"},{"$f":"WINEP_Schemes!N237","v":1},3.1E-2,3.1E-2,0,0,0,0,0,0]
[null,null,{"$f":"WINEP_Schemes!C238","v":"EAN00424"},{"$f":"WINEP_Schemes!D238","v":"7AW202263"},{"$f":"WINEP_Schemes!E238","v":"DrWPA - Glandford"},{"$f":"WINEP_Schemes!F238","v":"£m"},{"$f":"WINEP_Schemes!G238","v":1},{"$f":"WINEP_Schemes!H238","v":0},{"$f":"WINEP_Schemes!J238","v":1},{"$f":"WINEP_Schemes!I238","v":3.1E-2},{"$f":"WINEP_Schemes!K238","v":1},{"$f":"WINEP_Schemes!L238","v":1},{"$f":"WINEP_Schemes!M238","v":"WWN"},{"$f":"WINEP_Schemes!N238","v":1},3.1E-2,3.1E-2,0,0,0,0,0,0]
[null,null,{"$f":"WINEP_Schemes!C239","v":"EAN00428"},{"$f":"WINEP_Schemes!D239","v":"7AW202265"},{"$f":"WINEP_Schemes!E239","v":"DrWPA - Beachamwell"},{"$f":"WINEP_Schemes!F239","v":"£m"},{"$f":"WINEP_Schemes!G239","v":1},{"$f":"WINEP_Schemes!H239","v":0},{"$f":"WINEP_Schemes!J239","v":1},{"$f":"WINEP_Schemes!I239","v":3.1E-2},{"$f":"WINEP_Schemes!K239","v":1},{"$f":"WINEP_Schemes!L239","v":1},{"$f":"WINEP_Schemes!M239","v":"WWN"},{"$f":"WINEP_Schemes!N239","v":1},3.1E-2,3.1E-2,0,0,0,0,0,0]
[null,null,{"$f":"WINEP_Schemes!C240","v":"EAN00430"},{"$f":"WINEP_Schemes!D240","v":"7AW202266"},{"$f":"WINEP_Schemes!E240","v":"DrWPA - Isleham"},{"$f":"WINEP_Schemes!F240","v":"£m"},{"$f":"WINEP_Schemes!G240","v":1},{"$f":"WINEP_Schemes!H240","v":0},{"$f":"WINEP_Schemes!J240","v":1},{"$f":"WINEP_Schemes!I240","v":3.1E-2},{"$f":"WINEP_Schemes!K240","v":1},{"$f":"WINEP_Schemes!L240","v":1},{"$f":"WINEP_Schemes!M240","v":"WWN"},{"$f":"WINEP_Schemes!N240","v":1},3.1E-2,3.1E-2,0,0,0,0,0,0]
[null,null,{"$f":"WINEP_Schemes!C241","v":"EAN00431"},{"$f":"WINEP_Schemes!D241","v":"7AW202267"},{"$f":"WINEP_Schemes!E241","v":"DrWPA - Lower Links"},{"$f":"WINEP_Schemes!F241","v":"£m"},{"$f":"WINEP_Schemes!G241","v":1},{"$f":"WINEP_Schemes!H241","v":0},{"$f":"WINEP_Schemes!J241","v":1},{"$f":"WINEP_Schemes!I241","v":3.1E-2},{"$f":"WINEP_Schemes!K241","v":1},{"$f":"WINEP_Schemes!L241","v":1},{"$f":"WINEP_Schemes!M241","v":"WWN"},{"$f":"WINEP_Schemes!N241","v":1},3.1E-2,3.1E-2,0,0,0,0,0,0]
[null,null,{"$f":"WINEP_Schemes!C242","v":"EAN00432"},{"$f":"WINEP_Schemes!D242","v":"7AW202268"},{"$f":"WINEP_Schemes!E242","v":"DrWPA - Moulton"},{"$f":"WINEP_Schemes!F242","v":"£m"},{"$f":"WINEP_Schemes!G242","v":1},{"$f":"WINEP_Schemes!H242","v":0},{"$f":"WINEP_Schemes!J242","v":1},{"$f":"WINEP_Schemes!I242","v":3.1E-2},{"$f":"WINEP_Schemes!K242","v":1},{"$f":"WINEP_Schemes!L242","v":1},{"$f":"WINEP_Schemes!M242","v":"WWN"},{"$f":"WINEP_Schemes!N242","v":1},3.1E-2,3.1E-2,0,0,0,0,0,0]
[null,null,{"$f":"WINEP_Schemes!C243","v":"EAN00434"},{"$f":"WINEP_Schemes!D243","v":"7AW202269"},{"$f":"WINEP_Schemes!E243","v":"DrWPA - Nunnery Lodge"},{"$f":"WINEP_Schemes!F243","v":"£m"},{"$f":"WINEP_Schemes!G243","v":1},{"$f":"WINEP_Schemes!H243","v":0},{"$f":"WINEP_Schemes!J243","v":1},{"$f":"WINEP_Schemes!I243","v":3.1E-2},{"$f":"WINEP_Schemes!K243","v":1},{"$f":"WINEP_Schemes!L243","v":1},{"$f":"WINEP_Schemes!M243","v":"WWN"},{"$f":"WINEP_Schemes!N243","v":1},3.1E-2,3.1E-2,0,0,0,0,0,0]
[null,null,{"$f":"WINEP_Schemes!C244","v":"EAN00437"},{"$f":"WINEP_Schemes!D244","v":"7AW202270"},{"$f":"WINEP_Schemes!E244","v":"DrWPA - Square Plantation"},{"$f":"WINEP_Schemes!F244","v":"£m"},{"$f":"WINEP_Schemes!G244","v":1},{"$f":"WINEP_Schemes!H244","v":0},{"$f":"WINEP_Schemes!J244","v":1},{"$f":"WINEP_Schemes!I244","v":3.1E-2},{"$f":"WINEP_Schemes!K244","v":1},{"$f":"WINEP_Schemes!L244","v":1},{"$f":"WINEP_Schemes!M244","v":"WWN"},{"$f":"WINEP_Schemes!N244","v":1},3.1E-2,3.1E-2,0,0,0,0,0,0]
[null,null,{"$f":"WINEP_Schemes!C245","v":"EAN00442"},{"$f":"WINEP_Schemes!D245","v":"7AW202271"},{"$f":"WINEP_Schemes!E245","v":"DrWPA - Fring"},{"$f":"WINEP_Schemes!F245","v":"£m"},{"$f":"WINEP_Schemes!G245","v":1},{"$f":"WINEP_Schemes!H245","v":0},{"$f":"WINEP_Schemes!J245","v":1},{"$f":"WINEP_Schemes!I245","v":3.1E-2},{"$f":"WINEP_Schemes!K245","v":1},{"$f":"WINEP_Schemes!L245","v":1},{"$f":"WINEP_Schemes!M245","v":"WWN"},{"$f":"WINEP_Schemes!N245","v":1},3.1E-2,3.1E-2,0,0,0,0,0,0]
[null,null,{"$f":"WINEP_Schemes!C246","v":"EAN00443"},{"$f":"WINEP_Schemes!D246","v":"7AW202272"},{"$f":"WINEP_Schemes!E246","v":"DrWPA - Fring Osier Carr"},{"$f":"WINEP_Schemes!F246","v":"£m"},{"$f":"WINEP_Schemes!G246","v":1},{"$f":"WINEP_Schemes!H246","v":0},{"$f":"WINEP_Schemes!J246","v":1},{"$f":"WINEP_Schemes!I246","v":3.1E-2},{"$f":"WINEP_Schemes!K246","v":1},{"$f":"WINEP_Schemes!L246","v":1},{"$f":"WINEP_Schemes!M246","v":"WWN"},{"$f":"WINEP_Schemes!N246","v":1},3.1E-2,3.1E-2,0,0,0,0,0,0]
[null,null,{"$f":"WINEP_Schemes!C247","v":"EAN00445"},{"$f":"WINEP_Schemes!D247","v":"7AW202273"},{"$f":"WINEP_Schemes!E247","v":"DrWPA - Great Bircham"},{"$f":"WINEP_Schemes!F247","v":"£m"},{"$f":"WINEP_Schemes!G247","v":1},{"$f":"WINEP_Schemes!H247","v":0},{"$f":"WINEP_Schemes!J247","v":1},{"$f":"WINEP_Schemes!I247","v":3.1E-2},{"$f":"WINEP_Schemes!K247","v":1},{"$f":"WINEP_Schemes!L247","v":1},{"$f":"WINEP_Schemes!M247","v":"WWN"},{"$f":"WINEP_Schemes!N247","v":1},3.1E-2,3.1E-2,0,0,0,0,0,0]
[null,null,{"$f":"WINEP_Schemes!C248","v":"EAN00446"},{"$f":"WINEP_Schemes!D248","v":"7AW202274"},{"$f":"WINEP_Schemes!E248","v":"DrWPA - Hillington (Chalk)"},{"$f":"WINEP_Schemes!F248","v":"£m"},{"$f":"WINEP_Schemes!G248","v":1},{"$f":"WINEP_Schemes!H248","v":0},{"$f":"WINEP_Schemes!J248","v":1},{"$f":"WINEP_Schemes!I248","v":3.1E-2},{"$f":"WINEP_Schemes!K248","v":1},{"$f":"WINEP_Schemes!L248","v":1},{"$f":"WINEP_Schemes!M248","v":"WWN"},{"$f":"WINEP_Schemes!N248","v":1},3.1E-2,3.1E-2,0,0,0,0,0,0]
[null,null,{"$f":"WINEP_Schemes!C249","v":"CHM00048"},{"$f":"WINEP_Schemes!D249","v":"7AW300048"},{"$f":"WINEP_Schemes!E249","v":"Tuddenham STW (CIP2 T2)"},{"$f":"WINEP_Schemes!F249","v":0},{"$f":"WINEP_Schemes!G249","v":0},{"$f":"WINEP_Schemes!H249","v":0},{"$f":"WINEP_Schemes!J249","v":0},{"$f":"WINEP_Schemes!I249","v":0},{"$f":"WINEP_Schemes!K249","v":0},{"$f":"WINEP_Schemes!L249","v":0},{"$f":"WINEP_Schemes!M249","v":0},{"$f":"WINEP_Schemes!N249","v":0},0,0,0,0,0,0,0,0]
[null,null,{"$f":"WINEP_Schemes!C250","v":"EAN02408"},{"$f":"WINEP_Schemes!D250","v":"7AW300467"},{"$f":"WINEP_Schemes!E250","v":"Watton STW"},{"$f":"WINEP_Schemes!F250","v":"£m"},{"$f":"WINEP_Schemes!G250","v":1},{"$f":"WINEP_Schemes!H250","v":0},{"$f":"WINEP_Schemes!J250","v":1},{"$f":"WINEP_Schemes!I250","v":0.41599999999999998},{"$f":"WINEP_Schemes!K250","v":1},{"$f":"WINEP_Schemes!L250","v":1},{"$f":"WINEP_Schemes!M250","v":"WWN"},{"$f":"WINEP_Schemes!N250","v":1},0.41599999999999998,0.41599999999999998,0,0,0,0,0,0]
[null,null,{"$f":"WINEP_Schemes!C251","v":"LNA00380"},{"$f":"WINEP_Schemes!D251","v":"7AW300487"},{"$f":"WINEP_Schemes!E251","v":"Kirmington STW"},{"$f":"WINEP_Schemes!F251","v":0},{"$f":"WINEP_Schemes!G251","v":0},{"$f":"WINEP_Schemes!H251","v":0},{"$f":"WINEP_Schemes!J251","v":0},{"$f":"WINEP_Schemes!I251","v":0},{"$f":"WINEP_Schemes!K251","v":0},{"$f":"WINEP_Schemes!L251","v":0},{"$f":"WINEP_Schemes!M251","v":0},{"$f":"WINEP_Schemes!N251","v":0},0,0,0,0,0,0,0,0]
[null,null,{"$f":"WINEP_Schemes!C252","v":"EAN02441 "},{"$f":"WINEP_Schemes!D252","v":" 7AW100426 "},{"$f":"WINEP_Schemes!E252","v":" N NORFOLK Ch GW / East Ruston, Witton "},{"$f":"WINEP_Schemes!F252","v":" £m "},{"$f":"WINEP_Schemes!G252","v":1},{"$f":"WINEP_Schemes!H252","v":0},{"$f":"WINEP_Schemes!J252","v":2},{"$f":"WINEP_Schemes!I252","v":2.2999999999999998},{"$f":"WINEP_Schemes!K252","v":5},{"$f":"WINEP_Schemes!L252","v":1},{"$f":"WINEP_Schemes!M252","v":"WN"},{"$f":"WINEP_Schemes!N252","v":2.5},4.5999999999999996,11.5,6.8999999999999995,0,6.8999999999999995,0,0,0]
["EXPAND OR REDUCE THE BLOCK ABOVE TO INCLUDE ALL SCHEMES ON THE INPUT SHEET"]
[]
[null,null,null,null,null,null,null,null,null,null,null,null,null,null,null,null,{"$f":"SUM(Q11:Q253)","v":6.8999999999999995},{"$f":"SUM(R11:R253)","v":0},6.8999999999999995,0,0,0]
[null,"Check the total WINEP reconciliation against the sum of the price control totals"]
[]
[null,null,null,null,"Total WINEP Reconciliation",{"$f":" Q256","v":6.8999999999999995},"£m"]
[null,null,null,null,"Sum of the WINEP Reconciliation by price control",{"$f":" SUM(R256:V256)","v":6.8999999999999995},"£m"]
[]
[null,null,null,null,"Price Control Reconciliation vs Total Reconciliation - check",{"$f":" IF( F260 - F259 > Chk_Tol, 1, 0)","v":0},"check"]
[]
[null,"Total WINEP reconciliation for each price control"]
[]
[null,null,null,null,"Total Final Reconciliation, water resources",{"$f":" R256","v":0},"£m"]
[null,null,null,null,"Total Final Reconciliation, water network",{"$f":" S256","v":6.8999999999999995},"£m"]
[null,null,null,null,"Total Final Reconciliation, wastewater network",{"$f":" T256","v":0},"£m"]
[null,null,null,null,"Total Final Reconciliation, bioresources",{"$f":" U256","v":0},"£m"]
[null,null,null,null,"Total Final Reconciliation, dummy",{"$f":" V256","v":0},"£m"]
[]
[]
["End of sheet"]

{"sheet":"Outputs >>","index":12,"n_rows":0,"n_cols":0,"rows_kept":0,"cut":false,"hidden":false,"merged":[]}

{"sheet":"Annual_Outputs","index":13,"n_rows":54,"n_cols":16,"rows_kept":54,"cut":false,"hidden":false,"merged":[]}
[{"$f":" RIGHT(CELL(\"filename\", $A$1), LEN(CELL(\"filename\", $A$1)) - SEARCH(\"]\", CELL(\"filename\", $A$1)))","v":"Annual_Outputs"}]
[null,null,null,null,{"$f":"Time!E25","v":"Model period ending"},{"$f":"Check!F2","v":0},"Checks",null,null,{"$f":" Time!J$25","v":"2019-03-31"},{"$f":" Time!K$25","v":"2020-03-31"},{"$f":" Time!L$25","v":"2021-03-31"},{"$f":" Time!M$25","v":"2022-03-31"},{"$f":" Time!N$25","v":"2023-03-31"},{"$f":" Time!O$25","v":"2024-03-31"},{"$f":" Time!P$25","v":"2025-03-31"}]
[null,null,null,null,{"$f":"Time!E107","v":"Timeline label"},{"$f":"Check!F3","v":3},"Track chgs",null,null,{"$f":" Time!J$107","v":"Pre-Fcst"},{"$f":" Time!K$107","v":"Pre-Fcst"},{"$f":" Time!L$107","v":"Forecast"},{"$f":" Time!M$107","v":"Forecast"},{"$f":" Time!N$107","v":"Forecast"},{"$f":" Time!O$107","v":"Forecast"},{"$f":" Time!P$107","v":"Forecast"}]
[null,null,null,null,{"$f":"Time!E130","v":"Financial year ending"},null,null,null,null,{"$f":" Time!J$130","v":2019},{"$f":" Time!K$130","v":2020},{"$f":" Time!L$130","v":2021},{"$f":" Time!M$130","v":2022},{"$f":" Time!N$130","v":2023},{"$f":" Time!O$130","v":2024},{"$f":" Time!P$130","v":2025}]
[null,null,null,null,{"$f":"Time!E5","v":"Model column counter"},"Total","Unit",null,null,{"$f":" Time!I$10","v":0},{"$f":" Time!J$10","v":1},{"$f":" Time!K$10","v":2},{"$f":" Time!L$10","v":3},{"$f":" Time!M$10","v":4},{"$f":" Time!N$10","v":5},{"$f":" Time!O$10","v":6}]
[]
["ANNUAL ALLOWED COST"]
[]
[null,"WINEP reconciliation profiled across final 3 years of period"]
[]
[null,null,null,null,{"$f":"WINEP_Allowance!E266","v":"Total Final Reconciliation, water resources"},{"$f":"WINEP_Allowance!F266","v":0},{"$f":"WINEP_Allowance!G266","v":"£m"}]
[null,null,null,null,{"$f":"WINEP_Allowance!E267","v":"Total Final Reconciliation, water network"},{"$f":"WINEP_Allowance!F267","v":6.8999999999999995},{"$f":"WINEP_Allowance!G267","v":"£m"}]
[null,null,null,null,{"$f":"WINEP_Allowance!E268","v":"Total Final Reconciliation, wastewater network"},{"$f":"WINEP_Allowance!F268","v":0},{"$f":"WINEP_Allowance!G268","v":"£m"}]
[null,null,null,null,{"$f":"WINEP_Allowance!E269","v":"Total Final Reconciliation, bioresources"},{"$f":"WINEP_Allowance!F269","v":0},{"$f":"WINEP_Allowance!G269","v":"£m"}]
[null,null,null,null,{"$f":"WINEP_Allowance!E270","v":"Total Final Reconciliation, dummy"},{"$f":"WINEP_Allowance!F270","v":0},{"$f":"WINEP_Allowance!G270","v":"£m"}]
[]
[null,null,null,null,{"$f":" Time!E$93","v":"Start of adjustment profiling flag"},{"$f":" Time!F$93","v":0},{"$f":" Time!G$93","v":"counter"},{"$f":" Time!H$93","v":3},{"$f":" Time!I$93","v":0},{"$f":" Time!J$93","v":0},{"$f":" Time!K$93","v":0},{"$f":" Time!L$93","v":0},{"$f":" Time!M$93","v":0},{"$f":" Time!N$93","v":1},{"$f":" Time!O$93","v":1},{"$f":" Time!P$93","v":1}]
[]
[null,null,null,null,"Total Final Reconciliation - profiled, water resources",null,"£m",{"$f":" SUM(J19:P19)","v":0},null,{"$f":" IF( J$17 = 1, $F11 / 3, 0)","v":0},0,0,0,{"$f":" IF( N$17 = 1, $F11 / 3, 0)","v":0},{"$f":" IF( O$17 = 1, $F11 / 3, 0)","v":0},0]
[null,null,null,null,"Total Final Reconciliation - profiled, water network",null,"£m",{"$f":" SUM(J20:P20)","v":6.8999999999999995},null,{"$f":" IF( J$17 = 1, $F12 / 3, 0)","v":0},0,0,0,{"$f":" IF( N$17 = 1, $F12 / 3, 0)","v":2.2999999999999998},2.2999999999999998,2.2999999999999998]
[null,null,null,null,"Total Final Reconciliation - profiled, wastewater network",null,"£m",0,null,{"$f":" IF( J$17 = 1, $F13 / 3, 0)","v":0},0,0,0,{"$f":" IF( N$17 = 1, $F13 / 3, 0)","v":0},0,0]
[null,null,null,null,"Total Final Reconciliation - profiled, bioresources",null,"£m",0,null,{"$f":" IF( J$17 = 1, $F14 / 3, 0)","v":0},0,0,0,{"$f":" IF( N$17 = 1, $F14 / 3, 0)","v":0},0,0]
[null,null,null,null,"Total Final Reconciliation - profiled, dummy",null,"£m",0,null,{"$f":" IF( J$17 = 1, $F15 / 3, 0)","v":0},0,0,0,{"$f":" IF( N$17 = 1, $F15 / 3, 0)","v":0},0,0]
[]
[null,null,"WINEP reconciliation for cost reconciliation model"]
[null,null,null,null,"WINEP Reconciliation, water resources - without adjustment for time value of money",{"$f":"F19","v":0},"£m",0,0,0,0,0,0,0,0,0]
[null,null,null,null,"WINEP Reconciliation, water network - without adjustment for time value of money",{"$f":"F20","v":0},"£m",6.8999999999999995,0,0,0,0,0,2.2999999999999998,2.2999999999999998,2.2999999999999998]
[null,null,null,null,"WINEP Reconciliation, wastewater network - without adjustment for time value of money",{"$f":"F21","v":0},"£m",0,0,0,0,0,0,0,0,0]
[null,null,null,null,"WINEP Reconciliation, bioresources - without adjustment for time value of money",{"$f":"F22","v":0},"£m",0,0,0,0,0,0,0,0,0]
[null,null,null,null,"WINEP Reconciliation, dummy - without adjustment for time value of money",{"$f":"F23","v":0},"£m",0,0,0,0,0,0,0,0,0]
[]
[null,"WINEP reconciliation adjusted for time value of money"]
[]
[null,null,null,null,{"$f":" InpActive!E$33","v":"Financing cost index"},{"$f":" InpActive!F$33","v":0},{"$f":" InpActive!G$33","v":"Index"},null,null,{"$f":" InpActive!J$33","v":0},{"$f":" InpActive!K$33","v":0},{"$f":" InpActive!L$33","v":4},{"$f":" InpActive!M$33","v":3},{"$f":" InpActive!N$33","v":2},{"$f":" InpActive!O$33","v":1},{"$f":" InpActive!P$33","v":0}]
[null,null,null,null,{"$f":" InpActive!E$35","v":"Financing Cost"},{"$f":" InpActive!F$35","v":3.1199999999999999E-2},{"$f":" InpActive!G$35","v":"%"}]
[null,null,null,null,"Time value of money factor",null,"Factor",null,null,{"$f":"(1+$F35) ^ J$34","v":1},{"$f":"(1+$F35) ^ K$34","v":1},{"$f":"(1+$F35) ^ L$34","v":1.1307630728974334},1.0965506913279999,{"$f":"(1+$F35) ^ N$34","v":1.0633734399999999},{"$f":"(1+$F35) ^ O$34","v":1.0311999999999999},{"$f":"(1+$F35) ^ P$34","v":1}]
[]
[null,null,null,null,{"$f":" E26","v":"WINEP Reconciliation, water resources - without adjustment for time value of money"},{"$f":" F26","v":0},{"$f":" G26","v":"£m"},{"$f":" H26","v":0},0,{"$f":" J26","v":0},0,0,0,0,0,{"$f":" P26","v":0}]
[null,null,null,null,{"$f":" E27","v":"WINEP Reconciliation, water network - without adjustment for time value of money"},0,"£m",{"$f":" H27","v":6.8999999999999995},0,{"$f":" J27","v":0},0,0,0,2.2999999999999998,2.2999999999999998,{"$f":" P27","v":2.2999999999999998}]
[null,null,null,null,"WINEP Reconciliation, wastewater network - without adjustment for time value of money",0,"£m",{"$f":" H28","v":0},0,{"$f":" J28","v":0},0,0,0,0,0,{"$f":" P28","v":0}]
[null,null,null,null,"WINEP Reconciliation, bioresources - without adjustment for time value of money",0,"£m",{"$f":" H29","v":0},0,{"$f":" J29","v":0},0,0,0,0,0,{"$f":" P29","v":0}]
[null,null,null,null,"WINEP Reconciliation, dummy - without adjustment for time value of money",0,"£m",{"$f":" H30","v":0},0,{"$f":" J30","v":0},0,0,0,0,0,{"$f":" P30","v":0}]
[]
[null,null,null,null,{"$f":" E$36","v":"Time value of money factor"},{"$f":" F$36","v":0},"Factor",0,0,1,1,1.1307630728974334,1.0965506913279999,1.0633734399999999,1.0311999999999999,{"$f":" P$36","v":1}]
[]
[null,null,"WINEP reconciliation for PR24 RCV adjustment"]
[null,null,null,null,"WINEP Reconciliation, water resources - adjusted for time value of money",null,"£m",{"$f":" SUM(J47:P47)","v":0},null,{"$f":" J38 * J$44","v":0},0,0,0,0,0,0]
[null,null,null,null,"WINEP Reconciliation, water network - adjusted for time value of money",null,"£m",{"$f":" SUM(J48:P48)","v":7.1175189119999986},null,{"$f":" J39 * J$44","v":0},0,0,0,{"$f":" N39 * N$44","v":2.4457589119999996},2.3717599999999996,{"$f":" P39 * P$44","v":2.2999999999999998}]
[null,null,null,null,"WINEP Reconciliation, wastewater network - adjusted for time value of money",null,"£m",0,null,{"$f":" J40 * J$44","v":0},0,0,0,{"$f":" N40 * N$44","v":0},0,{"$f":" P40 * P$44","v":0}]
[null,null,null,null,"WINEP Reconciliation, bioresources - adjusted for time value of money",null,"£m",0,null,{"$f":" J41 * J$44","v":0},0,0,0,{"$f":" N41 * N$44","v":0},0,{"$f":" P41 * P$44","v":0}]
[null,null,null,null,"WINEP Reconciliation, dummy - adjusted for time value of money",null,"£m",0,null,{"$f":" J42 * J$44","v":0},0,0,0,{"$f":" N42 * N$44","v":0},0,{"$f":" P42 * P$44","v":0}]
[]
[]
["End of sheet"]

{"sheet":"F_Outputs","index":14,"n_rows":18,"n_cols":9,"rows_kept":18,"cut":false,"hidden":false,"merged":[]}
[null,null,"PR19FM007_WINEP_Out"]
["Acronym","Reference","Item description","Unit","Model","2022-23","2023-24","2024-25","2020-25"]
[]
[null,"BoN",{"$f":" Annual_Outputs!E26","v":"WINEP Reconciliation, water resources - without adjustment for time value of money"},"£m","Price Review 2019",{"$f":"Annual_Outputs!N26","v":0},{"$f":"Annual_Outputs!O26","v":0},{"$f":"Annual_Outputs!P26","v":0},{"$f":"Annual_Outputs!H26","v":0}]
[null,"BoN",{"$f":" Annual_Outputs!E27","v":"WINEP Reconciliation, water network - without adjustment for time value of money"},"£m","Price Review 2019",{"$f":"Annual_Outputs!N27","v":2.2999999999999998},{"$f":"Annual_Outputs!O27","v":2.2999999999999998},{"$f":"Annual_Outputs!P27","v":2.2999999999999998},{"$f":"Annual_Outputs!H27","v":6.8999999999999995}]
[null,"BoN",{"$f":" Annual_Outputs!E28","v":"WINEP Reconciliation, wastewater network - without adjustment for time value of money"},"£m","Price Review 2019",{"$f":"Annual_Outputs!N28","v":0},{"$f":"Annual_Outputs!O28","v":0},{"$f":"Annual_Outputs!P28","v":0},{"$f":"Annual_Outputs!H28","v":0}]
[null,"BoN",{"$f":" Annual_Outputs!E29","v":"WINEP Reconciliation, bioresources - without adjustment for time value of money"},"£m","Price Review 2019",{"$f":"Annual_Outputs!N29","v":0},{"$f":"Annual_Outputs!O29","v":0},{"$f":"Annual_Outputs!P29","v":0},{"$f":"Annual_Outputs!H29","v":0}]
[null,"BoN",{"$f":" Annual_Outputs!E30","v":"WINEP Reconciliation, dummy - without adjustment for time value of money"},"£m","Price Review 2019",{"$f":"Annual_Outputs!N30","v":0},{"$f":"Annual_Outputs!O30","v":0},{"$f":"Annual_Outputs!P30","v":0},{"$f":"Annual_Outputs!H30","v":0}]
[null,"BoN",{"$f":"Annual_Outputs!E47","v":"WINEP Reconciliation, water resources - adjusted for time value of money"},"£m","Price Review 2019",{"$f":"Annual_Outputs!N47","v":0},{"$f":"Annual_Outputs!O47","v":0},{"$f":"Annual_Outputs!P47","v":0},{"$f":"Annual_Outputs!H47","v":0}]
[null,"BoN",{"$f":"Annual_Outputs!E48","v":"WINEP Reconciliation, water network - adjusted for time value of money"},"£m","Price Review 2019",{"$f":"Annual_Outputs!N48","v":2.4457589119999996},{"$f":"Annual_Outputs!O48","v":2.3717599999999996},{"$f":"Annual_Outputs!P48","v":2.2999999999999998},{"$f":"Annual_Outputs!H48","v":7.1175189119999986}]
[null,"BoN",{"$f":"Annual_Outputs!E49","v":"WINEP Reconciliation, wastewater network - adjusted for time value of money"},"£m","Price Review 2019",{"$f":"Annual_Outputs!N49","v":0},{"$f":"Annual_Outputs!O49","v":0},{"$f":"Annual_Outputs!P49","v":0},{"$f":"Annual_Outputs!H49","v":0}]
[null,"BoN",{"$f":"Annual_Outputs!E50","v":"WINEP Reconciliation, bioresources - adjusted for time value of money"},"£m","Price Review 2019",{"$f":"Annual_Outputs!N50","v":0},{"$f":"Annual_Outputs!O50","v":0},{"$f":"Annual_Outputs!P50","v":0},{"$f":"Annual_Outputs!H50","v":0}]
[null,"BoN",{"$f":"Annual_Outputs!E51","v":"WINEP Reconciliation, dummy - adjusted for time value of money"},"£m","Price Review 2019",{"$f":"Annual_Outputs!N51","v":0},{"$f":"Annual_Outputs!O51","v":0},{"$f":"Annual_Outputs!P51","v":0},{"$f":"Annual_Outputs!H51","v":0}]
[null,"BoN_QA1","WINEP reconciliation model date stamp","text","Price Review 2019",{"$f":"CONCATENATE(\"[…]\", TEXT(NOW(), \"dd/mm/yyy hh:mm:ss\"))","v":"[…]06/12/2024 14:13:39"},"[…]06/12/2024 14:13:39","[…]06/12/2024 14:13:39","[…]06/12/2024 14:13:39"]
[null,"BoN_QA2","WINEP reconciliation model time stamp","text","Price Review 2019","[…]06/12/2024 14:13:39","[…]06/12/2024 14:13:39","[…]06/12/2024 14:13:39","[…]06/12/2024 14:13:39"]
[]
[]
["End of sheet"]

{"sheet":"QA >>","index":15,"n_rows":0,"n_cols":0,"rows_kept":0,"cut":false,"hidden":false,"merged":[]}

{"sheet":"Track","index":16,"n_rows":38,"n_cols":15,"rows_kept":38,"cut":false,"hidden":false,"merged":[]}
[{"$f":" RIGHT(CELL(\"filename\", $A$1), LEN(CELL(\"filename\", $A$1)) - SEARCH(\"]\", CELL(\"filename\", $A$1)))","v":"Track"},null,null,null,null,null,null,null,null,null,null,null,"do not del col",null,"do not del col"]
[null,null,null,null,null,{"$f":"Check!$F$2","v":0},"Checks",null,null,{"$f":" SUM(J7:J28)","v":3}]
[null,null,null,null,null,{"$f":"J2","v":3},"Track chgs"]
[]
[null,null,null,null,null,null,"Unit",null,null,{"$f":" MATCH($H$6, M6:O6, 0)","v":2},"Difference","Diff %"]
[null,null,null,null,"Comparison column label",null,null,"Nil inputs",null,null,null,null,null,"Nil inputs"]
[null,null,null,null,"[do not delete row]"]
["INPUTS"]
[null,null,null,null,null,null,null,null,null,{"$f":" IF(ABS(K9) > InpActive!$F$42, 1, 0)","v":0},{"$f":" H9 - INDEX(M9:O9, $J$5)","v":0},{"$f":" IF(ABS(K9) > InpActive!$F$42, IF(INDEX(M9:O9, $J$5) = 0, 0, H9 / INDEX(M9:O9, $J$5) - 1), 0)","v":0}]
[null,null,"Inputs",null,null,null,null,null,null,{"$f":" IF(ABS(K10) > InpActive!$F$42, 1, 0)","v":0},0,{"$f":" IF(ABS(K10) > InpActive!$F$42, IF(INDEX(M10:O10, $J$5) = 0, 0, H10 / INDEX(M10:O10, $J$5) - 1), 0)","v":0}]
[null,null,null,null,{"$f":" InpActive!E35","v":"Financing Cost"},null,{"$f":"InpActive!G35","v":"%"},{"$f":"InpActive!F35","v":3.1199999999999999E-2},null,{"$f":" IF(ABS(K11) > InpActive!$F$42, 1, 0)","v":1},3.1199999999999999E-2,{"$f":" IF(ABS(K11) > InpActive!$F$42, IF(INDEX(M11:O11, $J$5) = 0, 0, H11 / INDEX(M11:O11, $J$5) - 1), 0)","v":0},null,0]
[null,null,null,null,null,null,null,null,null,{"$f":" IF(ABS(K12) > InpActive!$F$42, 1, 0)","v":0},0,{"$f":" IF(ABS(K12) > InpActive!$F$42, IF(INDEX(M12:O12, $J$5) = 0, 0, H12 / INDEX(M12:O12, $J$5) - 1), 0)","v":0},null,0]
[null,null,null,null,null,null,null,null,null,{"$f":" IF(ABS(K13) > InpActive!$F$42, 1, 0)","v":0},0,{"$f":" IF(ABS(K13) > InpActive!$F$42, IF(INDEX(M13:O13, $J$5) = 0, 0, H13 / INDEX(M13:O13, $J$5) - 1), 0)","v":0},null,0]
[null,null,"Outputs",null,null,null,null,null,null,{"$f":" IF(ABS(K14) > InpActive!$F$42, 1, 0)","v":0},0,{"$f":" IF(ABS(K14) > InpActive!$F$42, IF(INDEX(M14:O14, $J$5) = 0, 0, H14 / INDEX(M14:O14, $J$5) - 1), 0)","v":0}]
[null,null,null,null,{"$f":" Annual_Outputs!E26","v":"WINEP Reconciliation, water resources - without adjustment for time value of money"},null,{"$f":" Annual_Outputs!G26","v":"£m"},{"$f":" Annual_Outputs!H26","v":0},null,{"$f":" IF(ABS(K15) > InpActive!$F$42, 1, 0)","v":0},0,{"$f":" IF(ABS(K15) > InpActive!$F$42, IF(INDEX(M15:O15, $J$5) = 0, 0, H15 / INDEX(M15:O15, $J$5) - 1), 0)","v":0},null,0]
[null,null,null,null,{"$f":" Annual_Outputs!E27","v":"WINEP Reconciliation, water network - without adjustment for time value of money"},null,{"$f":" Annual_Outputs!G27","v":"£m"},{"$f":" Annual_Outputs!H27","v":6.8999999999999995},null,{"$f":" IF(ABS(K16) > InpActive!$F$42, 1, 0)","v":1},6.8999999999999995,{"$f":" IF(ABS(K16) > InpActive!$F$42, IF(INDEX(M16:O16, $J$5) = 0, 0, H16 / INDEX(M16:O16, $J$5) - 1), 0)","v":0},null,0]
[null,null,null,null,{"$f":" Annual_Outputs!E28","v":"WINEP Reconciliation, wastewater network - without adjustment for time value of money"},null,{"$f":" Annual_Outputs!G28","v":"£m"},{"$f":" Annual_Outputs!H28","v":0},null,{"$f":" IF(ABS(K17) > InpActive!$F$42, 1, 0)","v":0},{"$f":" H17 - INDEX(M17:O17, $J$5)","v":0},{"$f":" IF(ABS(K17) > InpActive!$F$42, IF(INDEX(M17:O17, $J$5) = 0, 0, H17 / INDEX(M17:O17, $J$5) - 1), 0)","v":0},null,0]
[null,null,null,null,{"$f":" Annual_Outputs!E29","v":"WINEP Reconciliation, bioresources - without adjustment for time value of money"},null,{"$f":" Annual_Outputs!G29","v":"£m"},{"$f":" Annual_Outputs!H29","v":0},null,{"$f":" IF(ABS(K18) > InpActive!$F$42, 1, 0)","v":0},0,{"$f":" IF(ABS(K18) > InpActive!$F$42, IF(INDEX(M18:O18, $J$5) = 0, 0, H18 / INDEX(M18:O18, $J$5) - 1), 0)","v":0},null,0]
[null,null,null,null,{"$f":" Annual_Outputs!E30","v":"WINEP Reconciliation, dummy - without adjustment for time value of money"},null,{"$f":" Annual_Outputs!G30","v":"£m"},{"$f":" Annual_Outputs!H30","v":0},null,{"$f":" IF(ABS(K19) > InpActive!$F$42, 1, 0)","v":0},0,{"$f":" IF(ABS(K19) > InpActive!$F$42, IF(INDEX(M19:O19, $J$5) = 0, 0, H19 / INDEX(M19:O19, $J$5) - 1), 0)","v":0},null,0]
[null,null,null,null,{"$f":"Annual_Outputs!E47","v":"WINEP Reconciliation, water resources - adjusted for time value of money"},null,{"$f":"Annual_Outputs!G47","v":"£m"},{"$f":"Annual_Outputs!H47","v":0},null,{"$f":" IF(ABS(K20) > InpActive!$F$42, 1, 0)","v":0},{"$f":" H20 - INDEX(M20:O20, $J$5)","v":0},{"$f":" IF(ABS(K20) > InpActive!$F$42, IF(INDEX(M20:O20, $J$5) = 0, 0, H20 / INDEX(M20:O20, $J$5) - 1), 0)","v":0},null,0]
[null,null,null,null,{"$f":"Annual_Outputs!E48","v":"WINEP Reconciliation, water network - adjusted for time value of money"},null,{"$f":"Annual_Outputs!G48","v":"£m"},{"$f":"Annual_Outputs!H48","v":7.1175189119999986},null,{"$f":" IF(ABS(K21) > InpActive!$F$42, 1, 0)","v":1},{"$f":" H21 - INDEX(M21:O21, $J$5)","v":7.1175189119999986},{"$f":" IF(ABS(K21) > InpActive!$F$42, IF(INDEX(M21:O21, $J$5) = 0, 0, H21 / INDEX(M21:O21, $J$5) - 1), 0)","v":0},null,0]
[null,null,null,null,{"$f":"Annual_Outputs!E49","v":"WINEP Reconciliation, wastewater network - adjusted for time value of money"},null,{"$f":"Annual_Outputs!G49","v":"£m"},{"$f":"Annual_Outputs!H49","v":0},null,{"$f":" IF(ABS(K22) > InpActive!$F$42, 1, 0)","v":0},0,{"$f":" IF(ABS(K22) > InpActive!$F$42, IF(INDEX(M22:O22, $J$5) = 0, 0, H22 / INDEX(M22:O22, $J$5) - 1), 0)","v":0},null,0]
[null,null,null,null,{"$f":"Annual_Outputs!E50","v":"WINEP Reconciliation, bioresources - adjusted for time value of money"},null,{"$f":"Annual_Outputs!G50","v":"£m"},{"$f":"Annual_Outputs!H50","v":0},null,{"$f":" IF(ABS(K23) > InpActive!$F$42, 1, 0)","v":0},0,{"$f":" IF(ABS(K23) > InpActive!$F$42, IF(INDEX(M23:O23, $J$5) = 0, 0, H23 / INDEX(M23:O23, $J$5) - 1), 0)","v":0},null,0]
[null,null,null,null,{"$f":"Annual_Outputs!E51","v":"WINEP Reconciliation, dummy - adjusted for time value of money"},null,{"$f":"Annual_Outputs!G51","v":"£m"},{"$f":"Annual_Outputs!H51","v":0},null,{"$f":" IF(ABS(K24) > InpActive!$F$42, 1, 0)","v":0},0,{"$f":" IF(ABS(K24) > InpActive!$F$42, IF(INDEX(M24:O24, $J$5) = 0, 0, H24 / INDEX(M24:O24, $J$5) - 1), 0)","v":0},null,0]
[null,null,null,null,null,null,null,null,null,{"$f":" IF(ABS(K25) > InpActive!$F$42, 1, 0)","v":0},0,{"$f":" IF(ABS(K25) > InpActive!$F$42, IF(INDEX(M25:O25, $J$5) = 0, 0, H25 / INDEX(M25:O25, $J$5) - 1), 0)","v":0},null,0]
[null,null,null,null,null,null,null,null,null,{"$f":" IF(ABS(K26) > InpActive!$F$42, 1, 0)","v":0},0,{"$f":" IF(ABS(K26) > InpActive!$F$42, IF(INDEX(M26:O26, $J$5) = 0, 0, H26 / INDEX(M26:O26, $J$5) - 1), 0)","v":0},null,0]
[]
["INFO ONLY"]
[]
[null,null,null,null,"Date",null,null,{"$f":" TODAY()","v":"2024-12-06"}]
[null,null,null,null,"Time",null,null,{"$f":" NOW()","v":45632.592812731484}]
[null,null,null,null,"File",null,null,{"$f":" MID(CELL(\"filename\",$A$1), SEARCH(\"[\", CELL(\"filename\",$A$1)) + 1, SEARCH(\"]\", CELL(\"filename\",$A$1)) - SEARCH(\"[\", CELL(\"filename\",$A$1)) - 1)","v":"anh87-winep-reconciliation-model.xlsm"}]
[null,null,null,null,"[do not delete row]",null,null,null,null,"range end"]
[]
[null,null,null,null,"Comment: Key input and logic changes",null,null,null,null,null,null,null,null,"Nil inputs"]
[null,null,null,null,"Comment: Key result changes"]
[]
["End of sheet"]

{"sheet":"Check","index":17,"n_rows":27,"n_cols":7,"rows_kept":27,"cut":false,"hidden":false,"merged":[]}
[{"$f":" RIGHT(CELL(\"filename\", $A$1), LEN(CELL(\"filename\", $A$1)) - SEARCH(\"]\", CELL(\"filename\", $A$1)))","v":"Check"}]
[null,null,null,null,null,{"$f":"F11","v":0},"Checks"]
[null,null,null,null,null,{"$f":"F24","v":3},"Track chgs"]
[]
[null,null,null,null,null,"Constant","Unit"]
[]
["CHECK SUMMARY"]
[]
["MODEL INTEGRITY CHECKS"]
[]
[null,null,null,null,"Total model integrity checks",{"$f":" SUM(F16:F21)","v":0}]
[]
[null,null,null,null,"[do not delete row]"]
[]
[null,"WINEP RECONCILIATION"]
[null,null,null,null,{"$f":"WINEP_Allowance!E262","v":"Price Control Reconciliation vs Total Reconciliation - check"},{"$f":"WINEP_Allowance!F262","v":0},{"$f":"WINEP_Allowance!G262","v":"check"}]
[]
[null,"TIME"]
[null,null,null,null,{"$f":"Time!E121","v":"Modelling period check"},{"$f":"Time!F121","v":0},{"$f":"Time!G121","v":"check"}]
[]
[]
[null,null,null,null,"[do not delete row]"]
[]
[null,null,null,null,"Total track changes",{"$f":"Track!J2","v":3}]
[]
[]
["End of sheet"]